BDBM36986 1-(2,5-dimethyl-1-phenyl-3-pyrrolyl)-2-[(5-thiophen-2-yl-1,3,4-oxadiazol-2-yl)thio]ethanone::1-(2,5-dimethyl-1-phenyl-pyrrol-3-yl)-2-[(5-thiophen-2-yl-1,3,4-oxadiazol-2-yl)sulfanyl]ethanone::1-(2,5-dimethyl-1-phenyl-pyrrol-3-yl)-2-[[5-(2-thienyl)-1,3,4-oxadiazol-2-yl]thio]ethanone::1-(2,5-dimethyl-1-phenylpyrrol-3-yl)-2-[(5-thiophen-2-yl-1,3,4-oxadiazol-2-yl)sulfanyl]ethanone::MLS000058356::SMR000064018::cid_2082388
SMILES Cc1cc(C(=O)CSc2nnc(o2)-c2cccs2)c(C)n1-c1ccccc1
InChI Key InChIKey=ARHXSNGBUBHGRR-UHFFFAOYSA-N
Data  4 EC50
  Tab Delimited (TSV)   2D SDfile   Computed 3D by Vconf -m prep SDfile
Find this compound or compounds like it in BindingDB:
Activity Spreadsheet -- Enzyme Inhibition Constant Data from BindingDB
Found 4 hits for monomerid = 36986
TargetSphingosine 1-phosphate receptor 1(Homo sapiens (Human))
The Scripps Research Institute Molecular Screening Center
Curated by PubChem BioAssay
LigandPNGBDBM36986(1-(2,5-dimethyl-1-phenyl-3-pyrrolyl)-2-[(5-thiophe...)
Affinity DataEC50:  4.19E+3nM. Assay description: Source (MLSCN Center Name): The Scripps Research Institute Molecular Screening Center Center Affiliation: The Scripps Research Institute, TSRI Assay ...
In DepthDetails PCBioAssay
TargetMatrix metalloproteinase-14 [1-36](Homo sapiens (Human))
Sanford-Burnham Center For Chemical Genomics
Curated by PubChem BioAssay
LigandPNGBDBM36986(1-(2,5-dimethyl-1-phenyl-3-pyrrolyl)-2-[(5-thiophe...)
Affinity DataEC50:  7.72E+3nM. Assay description: Data Source: Sanford-Burnham Center for Chemical Genomics (SBCCG) Source Affiliation: Sanford-Burnham Medical Research Institute (SBMRI, San Diego, C...
In DepthDetails PCBioAssay
TargetSphingosine 1-phosphate receptor 1(Homo sapiens (Human))
The Scripps Research Institute Molecular Screening Center
Curated by PubChem BioAssay
LigandPNGBDBM36986(1-(2,5-dimethyl-1-phenyl-3-pyrrolyl)-2-[(5-thiophe...)
Affinity DataEC50:  4.66E+3nM. Assay description: Source (MLSCN Center Name): The Scripps Research Institute Molecular Screening Center Center Affiliation: The Scripps Research Institute, TSRI Assay ...
In DepthDetails PCBioAssay
TargetSphingosine 1-phosphate receptor 1(Homo sapiens (Human))
The Scripps Research Institute Molecular Screening Center
Curated by PubChem BioAssay
LigandPNGBDBM36986(1-(2,5-dimethyl-1-phenyl-3-pyrrolyl)-2-[(5-thiophe...)
Affinity DataEC50:  1.92E+4nM. Assay description: Source (MLSCN Center Name): The Scripps Research Institute Molecular Screening Center Center Affiliation: The Scripps Research Institute, TSRI Assay ...
In DepthDetails PCBioAssay