BDBM370349 US10233189, Example 5::US10787457, Example 5::US11014930, Example 5::US11236096, Example 5
SMILES Nc1ncnc2n(nc(C(=O)Nc3cc([nH]n3)-c3ccccc3)c12)C1CCCC1
InChI Key InChIKey=RKGBMAAJSFGSKT-UHFFFAOYSA-N
Data  4 IC50
  Tab Delimited (TSV)   2D SDfile   Computed 3D by Vconf -m prep SDfile
Find this compound or compounds like it in BindingDB:
Activity Spreadsheet -- Enzyme Inhibition Constant Data from BindingDB
Found 4 hits for monomerid = 370349
TargetProto-oncogene tyrosine-protein kinase receptor Ret(Homo sapiens (Human))
Taiho Pharmaceutical
US Patent
LigandPNGBDBM370349(US10233189, Example 5 | US10787457, Example 5 | US...)
Affinity DataIC50:  7.79nM. Assay description: To measure the inhibitory activity, first, the compounds of the present invention were individually diluted with dimethyl sulfoxide (DMSO) stepwise. ...
Ligand InfoPC cidPC sid
In DepthDetails US Patent
TargetProto-oncogene tyrosine-protein kinase receptor Ret(Homo sapiens (Human))
Taiho Pharmaceutical
US Patent
LigandPNGBDBM370349(US10233189, Example 5 | US10787457, Example 5 | US...)
Affinity DataIC50:  7.79nM. Assay description: Regarding the conditions for measurement of in vitro inhibitory activity of compounds against RET kinase activity, the website of AnaSpec states that...
Ligand InfoPC cidPC sid
In DepthDetails US Patent
TargetProto-oncogene tyrosine-protein kinase receptor Ret(Homo sapiens (Human))
Taiho Pharmaceutical
US Patent
LigandPNGBDBM370349(US10233189, Example 5 | US10787457, Example 5 | US...)
Affinity DataIC50:  7.79nM. Assay description: To measure the inhibitory activity, first, the compounds of the present invention were individually diluted with dimethyl sulfoxide (DMSO) stepwise. ...
Ligand InfoPC cidPC sid
In DepthDetails US Patent
TargetProto-oncogene tyrosine-protein kinase receptor Ret(Homo sapiens (Human))
Taiho Pharmaceutical
US Patent
LigandPNGBDBM370349(US10233189, Example 5 | US10787457, Example 5 | US...)
Affinity DataIC50:  7.79nM. Assay description: To measure the inhibitory activity, first, the compounds of the present invention were individually diluted with dimethyl sulfoxide (DMSO) stepwise. ...
Ligand InfoPC cidPC sid
In DepthDetails US Patent