BDBM370403 US10233189, Example 86::US10787457, Example 86::US11236096, Example 86
SMILES Cc1cc(NC(=O)c2c(C#CC3CCOCC3)n(c3ncnc(N)c23)C2(C)CC2)[nH]n1
InChI Key InChIKey=ZAAKPRKYIFTIIV-UHFFFAOYSA-N
Data  5 IC50
  Tab Delimited (TSV)   2D SDfile   Computed 3D by Vconf -m prep SDfile
Find this compound or compounds like it in BindingDB:
Activity Spreadsheet -- Enzyme Inhibition Constant Data from BindingDB
Found 5 hits for monomerid = 370403
TargetProto-oncogene tyrosine-protein kinase receptor Ret(Homo sapiens (Human))
Taiho Pharmaceutical
US Patent
LigandPNGBDBM370403(US10233189, Example 86 | US10787457, Example 86 | ...)
Affinity DataIC50:  0.150nM. Assay description: To measure the inhibitory activity, first, the compounds of the present invention were individually diluted with dimethyl sulfoxide (DMSO) stepwise. ...
Ligand InfoPC cidPC sid
In DepthDetails US Patent
TargetProto-oncogene tyrosine-protein kinase receptor Ret(Homo sapiens (Human))
Taiho Pharmaceutical
US Patent
LigandPNGBDBM370403(US10233189, Example 86 | US10787457, Example 86 | ...)
Affinity DataIC50:  0.150nM. Assay description: To measure the inhibitory activity, first, the compounds of the present invention were individually diluted with dimethyl sulfoxide (DMSO) stepwise. ...
Ligand InfoPC cidPC sid
In DepthDetails US Patent
TargetTyrosine-protein kinase Lck(Homo sapiens (Human))
Taiho Pharmaceutical
US Patent
LigandPNGBDBM370403(US10233189, Example 86 | US10787457, Example 86 | ...)
Affinity DataIC50:  427nM. Assay description: Regarding the conditions for measurement of in vitro inhibitory activity of compounds against LCK kinase activity, the website of AnaSpec states that...
Ligand InfoPC cidPC sid
In DepthDetails US Patent
TargetProto-oncogene tyrosine-protein kinase Src(Homo sapiens (Human))
Taiho Pharmaceutical
US Patent
LigandPNGBDBM370403(US10233189, Example 86 | US10787457, Example 86 | ...)
Affinity DataIC50:  12.9nM. Assay description: Regarding the conditions for measurement of in vitro inhibitory activity of compounds against SRC kinase activity, the price list of LabChip-series c...
Ligand InfoPC cidPC sid
In DepthDetails US Patent
TargetProto-oncogene tyrosine-protein kinase receptor Ret(Homo sapiens (Human))
Taiho Pharmaceutical
US Patent
LigandPNGBDBM370403(US10233189, Example 86 | US10787457, Example 86 | ...)
Affinity DataIC50:  0.150nM. Assay description: Regarding the conditions for measurement of in vitro inhibitory activity of compounds against RET kinase activity, the website of AnaSpec states that...
Ligand InfoPC cidPC sid
In DepthDetails US Patent