BDBM370488 1-(4,4-difluorocyclohexyl)-2-(6-fluoro-5H- imidazo[5,1-a]isoindol-5-yl)ethanol;::US10233190, Example 1406
SMILES OC(CC1c2c(cccc2F)-c2cncn12)C1CCC(F)(F)CC1
InChI Key InChIKey=FPKRCRNJVIHTNG-UHFFFAOYSA-N
Data  6 IC50  2 EC50
  Tab Delimited (TSV)   2D SDfile   Computed 3D by Vconf -m prep SDfile
Find this compound or compounds like it in BindingDB:
Activity Spreadsheet -- Enzyme Inhibition Constant Data from BindingDB
Found 8 hits for monomerid = 370488
TargetIndoleamine 2,3-dioxygenase 1(Homo sapiens (Human))
Newlink Genetics
US Patent
LigandPNGBDBM370488(1-(4,4-difluorocyclohexyl)-2-(6-fluoro-5H- imidazo...)
Affinity DataIC50: <1.00E+3nM. Assay description: The IC50 values for each compound were determined by testing the activity of IDO in a mixture containing 50 mM potassium phosphate buffer at pH 6.5; ...
Ligand InfoPC cidPC sid
In DepthDetails US Patent
TargetPotassium voltage-gated channel subfamily H member 2(Homo sapiens (Human))
Newlink Genetics
Curated by ChEMBL
LigandPNGBDBM370488(1-(4,4-difluorocyclohexyl)-2-(6-fluoro-5H- imidazo...)
Affinity DataEC50: >1.00E+5nM. Assay description: Inhibition of human ERG
Ligand InfoPC cidPC sid
In DepthDetails ArticlePubMed
TargetIndoleamine 2,3-dioxygenase 1(Homo sapiens (Human))
Newlink Genetics
US Patent
LigandPNGBDBM370488(1-(4,4-difluorocyclohexyl)-2-(6-fluoro-5H- imidazo...)
Affinity DataEC50:  93nM. Assay description: Inhibition of recombinant human IDO1 expressed in T-REx-293 cells assessed as reduction in kynurenine level measured after 16 hrs
Ligand InfoPC cidPC sid
In DepthDetails ArticlePubMed
TargetIndoleamine 2,3-dioxygenase 1(Homo sapiens (Human))
Newlink Genetics
US Patent
LigandPNGBDBM370488(1-(4,4-difluorocyclohexyl)-2-(6-fluoro-5H- imidazo...)
Affinity DataIC50:  100nM. Assay description: Inhibition of purified human IDO1 using L-tryptophan as substrate preincubated for 5 mins followed by substrate addition and measured after 15 mins b...
Ligand InfoPC cidPC sid
In DepthDetails ArticlePubMed
TargetCytochrome P450 2D6(Homo sapiens (Human))
Newlink Genetics
Curated by ChEMBL
LigandPNGBDBM370488(1-(4,4-difluorocyclohexyl)-2-(6-fluoro-5H- imidazo...)
Affinity DataIC50:  2.00E+4nM. Assay description: Inhibition of CYP2D6 (unknown origin)
Ligand InfoPC cidPC sid
In DepthDetails ArticlePubMed
TargetCytochrome P450 1A2(Homo sapiens (Human))
Newlink Genetics
Curated by ChEMBL
LigandPNGBDBM370488(1-(4,4-difluorocyclohexyl)-2-(6-fluoro-5H- imidazo...)
Affinity DataIC50: >1.00E+5nM. Assay description: Inhibition of CYP1A2 (unknown origin)
Ligand InfoPC cidPC sid
In DepthDetails ArticlePubMed
TargetCytochrome P450 3A4(Homo sapiens (Human))
Newlink Genetics
Curated by ChEMBL
LigandPNGBDBM370488(1-(4,4-difluorocyclohexyl)-2-(6-fluoro-5H- imidazo...)
Affinity DataIC50:  2.60E+3nM. Assay description: Inhibition of CYP3A4 (unknown origin) using midazolam as substrate
Ligand InfoPC cidPC sid
In DepthDetails ArticlePubMed
TargetCytochrome P450 2B6(Homo sapiens (Human))
Newlink Genetics
Curated by ChEMBL
LigandPNGBDBM370488(1-(4,4-difluorocyclohexyl)-2-(6-fluoro-5H- imidazo...)
Affinity DataIC50: >1.00E+5nM. Assay description: Inhibition of CYP2B6 (unknown origin)
Ligand InfoPC cidPC sid
In DepthDetails ArticlePubMed