BDBM37095 4-(6-methyl-5-imidazo[2,1-b]thiazolyl)-N-(phenylmethyl)-2-thiazolamine::4-(6-methylimidazo[2,1-b][1,3]thiazol-5-yl)-N-(phenylmethyl)-1,3-thiazol-2-amine::MLS000090069::N-benzyl-4-(6-methylimidazo[2,1-b][1,3]thiazol-5-yl)-1,3-thiazol-2-amine::SMR000024687::benzyl-[4-(6-methylimidazo[2,1-b]thiazol-5-yl)thiazol-2-yl]amine::cid_800766
SMILES Cc1nc2sccn2c1-c1csc(NCc2ccccc2)n1
InChI Key InChIKey=QLJGQLPHQVQVJE-UHFFFAOYSA-N
Data  6 IC50  3 EC50
  Tab Delimited (TSV)   2D SDfile   Computed 3D by Vconf -m prep SDfile
Find this compound or compounds like it in BindingDB:
Activity Spreadsheet -- Enzyme Inhibition Constant Data from BindingDB
Found 9 hits for monomerid = 37095
TargetSphingosine 1-phosphate receptor 1(Homo sapiens (Human))
The Scripps Research Institute Molecular Screening Center
Curated by PubChem BioAssay
LigandPNGBDBM37095(4-(6-methyl-5-imidazo[2,1-b]thiazolyl)-N-(phenylme...)
Affinity DataEC50:  3.60E+3nM. Assay description: Source (MLSCN Center Name): The Scripps Research Institute Molecular Screening Center Center Affiliation: The Scripps Research Institute, TSRI Assay ...
In DepthDetails PCBioAssay
TargetSphingosine 1-phosphate receptor 1(Homo sapiens (Human))
The Scripps Research Institute Molecular Screening Center
Curated by PubChem BioAssay
LigandPNGBDBM37095(4-(6-methyl-5-imidazo[2,1-b]thiazolyl)-N-(phenylme...)
Affinity DataEC50:  2.00E+4nM. Assay description: Source (MLSCN Center Name): The Scripps Research Institute Molecular Screening Center Center Affiliation: The Scripps Research Institute, TSRI Assay ...
In DepthDetails PCBioAssay
TargetSphingosine 1-phosphate receptor 1(Homo sapiens (Human))
The Scripps Research Institute Molecular Screening Center
Curated by PubChem BioAssay
LigandPNGBDBM37095(4-(6-methyl-5-imidazo[2,1-b]thiazolyl)-N-(phenylme...)
Affinity DataEC50:  2.78E+3nM. Assay description: Source (MLSCN Center Name): The Scripps Research Institute Molecular Screening Center Center Affiliation: The Scripps Research Institute, TSRI Assay ...
In DepthDetails PCBioAssay
TargetIsoform 2 of Nuclear receptor ROR-alpha (Alpha-2)(Homo sapiens (Human))
The Scripps Research Institute Molecular Screening Center
Curated by PubChem BioAssay
LigandPNGBDBM37095(4-(6-methyl-5-imidazo[2,1-b]thiazolyl)-N-(phenylme...)
Affinity DataIC50:  6.74E+3nM. Assay description: Source (MLSCN Center Name): The Scripps Research Institute Molecular Screening Center Center Affiliation: The Scripps Research Institute, TSRI Assay ...
In DepthDetails PCBioAssay
TargetProtein Wnt-3a(Mus musculus)
Burnham Center For Chemical Genomics
Curated by PubChem BioAssay
LigandPNGBDBM37095(4-(6-methyl-5-imidazo[2,1-b]thiazolyl)-N-(phenylme...)
Affinity DataIC50: >5.00E+4nM
In DepthDetails PCBioAssay
TargetSignal transducer and activator of transcription 3 [702-738,740-752](Homo sapiens (Human))
The Scripps Research Institute Molecular Screening Center
Curated by PubChem BioAssay
LigandPNGBDBM37095(4-(6-methyl-5-imidazo[2,1-b]thiazolyl)-N-(phenylme...)
Affinity DataIC50:  4.37E+3nM. Assay description: Source (MLPCN Center Name): The Scripps Research Institute Molecular Screening Center Center Affiliation: The Scripps Research Institute (TSRI) Assay...
In DepthDetails PCBioAssay
TargetSignal transducer and activator of transcription 1-alpha/beta(Homo sapiens (Human))
The Scripps Research Institute Molecular Screening Center
Curated by PubChem BioAssay
LigandPNGBDBM37095(4-(6-methyl-5-imidazo[2,1-b]thiazolyl)-N-(phenylme...)
Affinity DataIC50: >5.57E+4nM. Assay description: Source (MLPCN Center Name): The Scripps Research Institute Molecular Screening Center Center Affiliation: The Scripps Research Institute (TSRI) Assay...
In DepthDetails PCBioAssay
TargetZinc finger protein GLI1(Mus musculus)
Burnham Center For Chemical Genomics
Curated by PubChem BioAssay
LigandPNGBDBM37095(4-(6-methyl-5-imidazo[2,1-b]thiazolyl)-N-(phenylme...)
Affinity DataIC50:  9.83E+3nM. Assay description: Data Source: Sanford-Burnham Center for Chemical Genomics (SBCCG) Source Affiliation: Sanford-Burnham Medical Research Institute (SBMRI, San Diego, C...
In DepthDetails PCBioAssay
TargetSteroidogenic factor 1(Homo sapiens (Human))
The Scripps Research Institute Molecular Screening Center
Curated by PubChem BioAssay
LigandPNGBDBM37095(4-(6-methyl-5-imidazo[2,1-b]thiazolyl)-N-(phenylme...)
Affinity DataIC50:  1.11E+4nM. Assay description: Source (MLSCN Center Name): The Scripps Research Institute Molecular Screening Center Center Affiliation: The Scripps Research Institute, TSRI Assay ...
In DepthDetails PCBioAssay