BDBM37133 MLS000061826::N-[4-(5-methyl-1,3-benzoxazol-2-yl)phenyl]butanamide::N-[4-(5-methyl-1,3-benzoxazol-2-yl)phenyl]butyramide::SMR000070304::cid_876225
SMILES CCCC(=O)Nc1ccc(cc1)-c1nc2cc(C)ccc2o1
InChI Key InChIKey=KKLIRGYHEBRBGG-UHFFFAOYSA-N
Data  3 IC50  4 EC50
  Tab Delimited (TSV)   2D SDfile   Computed 3D by Vconf -m prep SDfile
Find this compound or compounds like it in BindingDB:
Activity Spreadsheet -- Enzyme Inhibition Constant Data from BindingDB
Found 7 hits for monomerid = 37133
TargetSphingosine 1-phosphate receptor 1(Homo sapiens (Human))
The Scripps Research Institute Molecular Screening Center
Curated by PubChem BioAssay
LigandPNGBDBM37133(MLS000061826 | N-[4-(5-methyl-1,3-benzoxazol-2-yl)...)
Affinity DataEC50:  6.37E+3nM. Assay description: Source (MLSCN Center Name): The Scripps Research Institute Molecular Screening Center Center Affiliation: The Scripps Research Institute, TSRI Assay ...
In DepthDetails PCBioAssay
TargetSphingosine 1-phosphate receptor 1(Homo sapiens (Human))
The Scripps Research Institute Molecular Screening Center
Curated by PubChem BioAssay
LigandPNGBDBM37133(MLS000061826 | N-[4-(5-methyl-1,3-benzoxazol-2-yl)...)
Affinity DataEC50: >9.51E+4nM. Assay description: Source (MLSCN Center Name): The Scripps Research Institute Molecular Screening Center Center Affiliation: The Scripps Research Institute, TSRI Assay ...
In DepthDetails PCBioAssay
TargetSphingosine 1-phosphate receptor 1(Homo sapiens (Human))
The Scripps Research Institute Molecular Screening Center
Curated by PubChem BioAssay
LigandPNGBDBM37133(MLS000061826 | N-[4-(5-methyl-1,3-benzoxazol-2-yl)...)
Affinity DataEC50:  5.96E+3nM. Assay description: Source (MLSCN Center Name): The Scripps Research Institute Molecular Screening Center Center Affiliation: The Scripps Research Institute, TSRI Assay ...
In DepthDetails PCBioAssay
TargetCaspase-3(Homo sapiens (Human))
Burnham Center For Chemical Genomics
Curated by PubChem BioAssay
LigandPNGBDBM37133(MLS000061826 | N-[4-(5-methyl-1,3-benzoxazol-2-yl)...)
Affinity DataIC50:  2.35E+4nM. Assay description: Data Source: Sanford-Burnham Center for Chemical Genomics (SBCCG) Source Affiliation: Sanford-Burnham Medical Research Institute (SBMRI, San Diego, C...
In DepthDetails PCBioAssay
TargetSentrin-specific protease 8(Homo sapiens (Human))
Burnham Center For Chemical Genomics
Curated by PubChem BioAssay
LigandPNGBDBM37133(MLS000061826 | N-[4-(5-methyl-1,3-benzoxazol-2-yl)...)
Affinity DataIC50:  4.52E+4nM. Assay description: Data Source: Sanford-Burnham Center for Chemical Genomics (SBCCG) Source Affiliation: Sanford-Burnham Medical Research Institute (SBMRI, San Diego, C...
In DepthDetails PCBioAssay
TargetSentrin-specific protease 6(Homo sapiens (Human))
Burnham Center For Chemical Genomics
Curated by PubChem BioAssay
LigandPNGBDBM37133(MLS000061826 | N-[4-(5-methyl-1,3-benzoxazol-2-yl)...)
Affinity DataIC50:  6.47E+4nM. Assay description: Data Source: Sanford-Burnham Center for Chemical Genomics (SBCCG) Source Affiliation: Sanford-Burnham Medical Research Institute (SBMRI, San Diego, C...
In DepthDetails PCBioAssay
TargetMatrix metalloproteinase-14 [1-36](Homo sapiens (Human))
Sanford-Burnham Center For Chemical Genomics
Curated by PubChem BioAssay
LigandPNGBDBM37133(MLS000061826 | N-[4-(5-methyl-1,3-benzoxazol-2-yl)...)
Affinity DataEC50:  1.20E+4nM. Assay description: Data Source: Sanford-Burnham Center for Chemical Genomics (SBCCG) Source Affiliation: Sanford-Burnham Medical Research Institute (SBMRI, San Diego, C...
In DepthDetails PCBioAssay