BDBM372521 N-[2-(3,5-Difluoro-4-methoxy-benzyl)-2H-[1,2,3]triazol-4-yl]-2-(1-methyl-1H-indol-5-yl)-acetamide::US10246426, Example 77
SMILES COc1c(F)cc(Cn2ncc(NC(=O)Cc3ccc4n(C)ccc4c3)n2)cc1F
InChI Key InChIKey=CEZQTYVJVLAGKU-UHFFFAOYSA-N
Data  1 IC50
  Tab Delimited (TSV)   2D SDfile   Computed 3D by Vconf -m prep SDfile
Find this compound or compounds like it in BindingDB:
Activity Spreadsheet -- Enzyme Inhibition Constant Data from BindingDB
Found 1 hit for monomerid = 372521
TargetVoltage-dependent T-type calcium channel subunit alpha-1H(Homo sapiens (Human))
Idorsia Pharmaceuticals
US Patent
LigandPNGBDBM372521(N-[2-(3,5-Difluoro-4-methoxy-benzyl)-2H-[1,2,3]tri...)
Affinity DataIC50:  13nM. Assay description: Stock solutions of test compounds are prepared to a concentration of 10 mM in DMSO. For the Cav3.2 assay, serial dilutions of the compounds are prepa...
Ligand InfoPC cidPC sid
In DepthDetails US Patent