BDBM37309 7-((Z)-3-Chloro-but-2-enyl)-1,3-dimethyl-8-pyrrolidin-1-yl-3,7-dihydro-purine-2,6-dione::7-[(Z)-3-chloranylbut-2-enyl]-1,3-dimethyl-8-pyrrolidin-1-yl-purine-2,6-dione::7-[(Z)-3-chlorobut-2-enyl]-1,3-dimethyl-8-(1-pyrrolidinyl)purine-2,6-dione::7-[(Z)-3-chlorobut-2-enyl]-1,3-dimethyl-8-pyrrolidin-1-ylpurine-2,6-dione::7-[(Z)-3-chlorobut-2-enyl]-1,3-dimethyl-8-pyrrolidino-xanthine::MLS000034655::SMR000013795::cid_944334
SMILES C\C(Cl)=C\Cn1c(nc2n(C)c(=O)n(C)c(=O)c12)N1CCCC1
InChI Key InChIKey=TZXLROIEGGQFOO-POHAHGRESA-N
Data  1 EC50
  Tab Delimited (TSV)   2D SDfile   Computed 3D by Vconf -m prep SDfile
Find this compound or compounds like it in BindingDB:
Activity Spreadsheet -- Enzyme Inhibition Constant Data from BindingDB
Found 1 hit for monomerid = 37309
TargetSphingosine 1-phosphate receptor 3(Homo sapiens (Human))
The Scripps Research Institute Molecular Screening Center
Curated by PubChem BioAssay
LigandPNGBDBM37309(7-((Z)-3-Chloro-but-2-enyl)-1,3-dimethyl-8-pyrroli...)
Affinity DataEC50:  3.85E+4nM. Assay description: Source (MLSCN Center Name): The Scripps Research Institute Molecular Screening Center Center Affiliation: The Scripps Research Institute, TSRI Networ...
In DepthDetails PCBioAssay