BDBM37318 2-(3,5-dimethyl-1-pyrazolyl)-N-(2-methoxyethyl)-5,6,7,8-tetrahydro-[1]benzothiolo[2,3-d]pyrimidin-4-amine::2-(3,5-dimethylpyrazol-1-yl)-N-(2-methoxyethyl)-5,6,7,8-tetrahydro-[1]benzothiolo[2,3-d]pyrimidin-4-amine::MLS000082985::SMR000046530::[2-(3,5-dimethylpyrazol-1-yl)-5,6,7,8-tetrahydrobenzothiopheno[2,3-d]pyrimidin-4-yl]-(2-methoxyethyl)amine::cid_665355
SMILES COCCNc1nc(nc2sc3CCCCc3c12)-n1nc(C)cc1C
InChI Key InChIKey=VUKAFZKFNOJEEK-UHFFFAOYSA-N
Data  1 IC50  1 EC50
  Tab Delimited (TSV)   2D SDfile   Computed 3D by Vconf -m prep SDfile
Find this compound or compounds like it in BindingDB:
Activity Spreadsheet -- Enzyme Inhibition Constant Data from BindingDB
Found 2 hits for monomerid = 37318
TargetProtein artemis(Homo sapiens (Human))
Burnham Center For Chemical Genomics
Curated by PubChem BioAssay
LigandPNGBDBM37318(2-(3,5-dimethyl-1-pyrazolyl)-N-(2-methoxyethyl)-5,...)
Affinity DataIC50:  1.17E+4nM. Assay description: Data Source: Sanford-Burnham Center for Chemical Genomics (SBCCG) Source Affiliation: Sanford-Burnham Medical Research Institute (SBMRI, San Diego CA...
In DepthDetails PCBioAssay
TargetSphingosine 1-phosphate receptor 3(Homo sapiens (Human))
The Scripps Research Institute Molecular Screening Center
Curated by PubChem BioAssay
LigandPNGBDBM37318(2-(3,5-dimethyl-1-pyrazolyl)-N-(2-methoxyethyl)-5,...)
Affinity DataEC50:  1.33E+4nM. Assay description: Source (MLSCN Center Name): The Scripps Research Institute Molecular Screening Center Center Affiliation: The Scripps Research Institute, TSRI Networ...
In DepthDetails PCBioAssay