BDBM37323 2-amino-N-(2-furanylmethyl)-1-[(4-methoxyphenyl)methyl]-3-pyrrolo[3,2-b]quinoxalinecarboxamide::2-amino-N-(2-furfuryl)-1-p-anisyl-pyrrolo[3,2-b]quinoxaline-3-carboxamide::2-amino-N-(furan-2-ylmethyl)-1-[(4-methoxyphenyl)methyl]pyrrolo[3,2-b]quinoxaline-3-carboxamide::2-azanyl-N-(furan-2-ylmethyl)-1-[(4-methoxyphenyl)methyl]pyrrolo[3,2-b]quinoxaline-3-carboxamide::MLS000048764::SMR000061855::cid_2426783
SMILES COc1ccc(Cn2c(N)c(C(=O)NCc3ccco3)c3nc4ccccc4nc23)cc1
InChI Key InChIKey=MPYWRQURLVGNED-UHFFFAOYSA-N
Data  1 IC50  1 EC50
  Tab Delimited (TSV)   2D SDfile   Computed 3D by Vconf -m prep SDfile
Find this compound or compounds like it in BindingDB:
Activity Spreadsheet -- Enzyme Inhibition Constant Data from BindingDB
Found 2 hits for monomerid = 37323
TargetEstrogen receptor(Homo sapiens (Human))
Emory University
Curated by PubChem BioAssay
LigandPNGBDBM37323(2-amino-N-(2-furanylmethyl)-1-[(4-methoxyphenyl)me...)
Affinity DataIC50:  1.73E+4nM. Assay description: NIH Molecular Libraries Screening Centers Network [MLSCN] Emory Chemical Biology Discovery Center in MLSCN Assay provider: John A. Katzenellenbogen, ...
In DepthDetails PCBioAssay
TargetSphingosine 1-phosphate receptor 3(Homo sapiens (Human))
The Scripps Research Institute Molecular Screening Center
Curated by PubChem BioAssay
LigandPNGBDBM37323(2-amino-N-(2-furanylmethyl)-1-[(4-methoxyphenyl)me...)
Affinity DataEC50:  1.98E+4nM. Assay description: Source (MLSCN Center Name): The Scripps Research Institute Molecular Screening Center Center Affiliation: The Scripps Research Institute, TSRI Networ...
In DepthDetails PCBioAssay