BDBM373970 (S)-4-((1-(2,3-difluorobenzyl)pyrrolidin-3-yl)(methyl)amino)-2,6-difluoro-3-methyl-N-(thiazol-4-yl)benzenesulfonamide formate::US10246453, Example 237::US10815229, Example 237
SMILES CN([C@H]1CCN(Cc2cccc(F)c2F)C1)c1cc(F)c(c(F)c1C)S(=O)(=O)Nc1cscn1
InChI Key InChIKey=KKALBNJTIFZMBP-HNNXBMFYSA-N
Data  6 IC50
  Tab Delimited (TSV)   2D SDfile   Computed 3D by Vconf -m prep SDfile
Find this compound or compounds like it in BindingDB:
Activity Spreadsheet -- Enzyme Inhibition Constant Data from BindingDB
Found 6 hits for monomerid = 373970
TargetSodium channel protein type 8 subunit alpha(Homo sapiens (Human))
Xenon Pharmaceuticals
US Patent
LigandPNGBDBM373970((S)-4-((1-(2,3-difluorobenzyl)pyrrolidin-3-yl)(met...)
Affinity DataIC50:  64nM. Assay description: This sodium influx assay employs the use of the cell permeable, sodium sensitive dye ANG2 to quantify sodium ion influx through sodium channels which...
Ligand InfoPC cidPC sid
In DepthDetails US Patent
TargetSodium channel protein type 5 subunit alpha(Homo sapiens (Human))
Xenon Pharmaceuticals
US Patent
LigandPNGBDBM373970((S)-4-((1-(2,3-difluorobenzyl)pyrrolidin-3-yl)(met...)
Affinity DataIC50:  1.47E+4nM. Assay description: This sodium influx assay employs the use of the cell permeable, sodium sensitive dye ANG2 to quantify sodium ion influx through sodium channels which...
Ligand InfoPC cidPC sid
In DepthDetails US Patent
TargetSodium channel protein type 1 subunit alpha(Homo sapiens (Human))
Xenon Pharmaceuticals
US Patent
LigandPNGBDBM373970((S)-4-((1-(2,3-difluorobenzyl)pyrrolidin-3-yl)(met...)
Affinity DataIC50:  8.52E+3nM. Assay description: In general, Trex HEK293 cells were stably transfected with an inducible expression vector containing the full-length cDNA coding for the desired huma...
Ligand InfoPC cidPC sid
In DepthDetails US Patent
TargetSodium channel protein type 8 subunit alpha(Homo sapiens (Human))
Xenon Pharmaceuticals
US Patent
LigandPNGBDBM373970((S)-4-((1-(2,3-difluorobenzyl)pyrrolidin-3-yl)(met...)
Affinity DataIC50:  64nM. Assay description: In general, Trex HEK293 cells were stably transfected with an inducible expression vector containing the full-length cDNA coding for the desired huma...
Ligand InfoPC cidPC sid
In DepthDetails US Patent
TargetSodium channel protein type 5 subunit alpha(Homo sapiens (Human))
Xenon Pharmaceuticals
US Patent
LigandPNGBDBM373970((S)-4-((1-(2,3-difluorobenzyl)pyrrolidin-3-yl)(met...)
Affinity DataIC50:  1.47E+4nM. Assay description: In general, Trex HEK293 cells were stably transfected with an inducible expression vector containing the full-length cDNA coding for the desired huma...
Ligand InfoPC cidPC sid
In DepthDetails US Patent
TargetSodium channel protein type 1 subunit alpha(Homo sapiens (Human))
Xenon Pharmaceuticals
US Patent
LigandPNGBDBM373970((S)-4-((1-(2,3-difluorobenzyl)pyrrolidin-3-yl)(met...)
Affinity DataIC50:  8.52E+3nM. Assay description: This sodium influx assay employs the use of the cell permeable, sodium sensitive dye ANG2 to quantify sodium ion influx through sodium channels which...
Ligand InfoPC cidPC sid
In DepthDetails US Patent