BDBM37427 1-[7-(difluoromethyl)-5-(p-tolyl)pyrazolo[1,5-a]pyrimidine-3-carbonyl]nipecotic acid ethyl ester::1-[[7-(difluoromethyl)-5-(4-methylphenyl)-3-pyrazolo[1,5-a]pyrimidinyl]-oxomethyl]-3-piperidinecarboxylic acid ethyl ester::MLS000052830::SMR000082287::cid_2980779::ethyl 1-[7-(difluoromethyl)-5-(4-methylphenyl)pyrazolo[1,5-a]pyrimidine-3-carbonyl]piperidine-3-carboxylate::ethyl 1-[7-[bis(fluoranyl)methyl]-5-(4-methylphenyl)pyrazolo[1,5-a]pyrimidin-3-yl]carbonylpiperidine-3-carboxylate::ethyl 1-{[7-(difluoromethyl)-5-(4-methylphenyl)pyrazolo[1,5-a]pyrimidin-3-yl]carbonyl}-3-piperidinecarboxylate
SMILES CCOC(=O)C1CCCN(C1)C(=O)c1cnn2c(cc(nc12)-c1ccc(C)cc1)C(F)F
InChI Key InChIKey=VTYKWIRHZOHICQ-UHFFFAOYSA-N
Data  2 IC50
  Tab Delimited (TSV)   2D SDfile   Computed 3D by Vconf -m prep SDfile
Find this compound or compounds like it in BindingDB:
Activity Spreadsheet -- Enzyme Inhibition Constant Data from BindingDB
Found 2 hits for monomerid = 37427
TargetMitochondrial peptide methionine sulfoxide reductase(Bos taurus)
The Scripps Research Institute Molecular Screening Center
Curated by PubChem BioAssay
LigandPNGBDBM37427(1-[7-(difluoromethyl)-5-(p-tolyl)pyrazolo[1,5-a]py...)
Affinity DataIC50: >1.55E+5nM
In DepthDetails PCBioAssay
TargetSphingosine 1-phosphate receptor 3(Homo sapiens (Human))
The Scripps Research Institute Molecular Screening Center
Curated by PubChem BioAssay
LigandPNGBDBM37427(1-[7-(difluoromethyl)-5-(p-tolyl)pyrazolo[1,5-a]py...)
Affinity DataIC50: >4.98E+4nM. Assay description: Source (MLSCN Center Name): The Scripps Research Institute Molecular Screening Center Center Affiliation: The Scripps Research Institute, TSRI Assay ...
In DepthDetails PCBioAssay