BDBM37457 7-(dimethylamino)-3,5-dimethyl-2-thiazolo[4,5-d]pyrimidinethione::7-(dimethylamino)-3,5-dimethyl-[1,3]thiazolo[4,5-d]pyrimidine-2-thione::7-(dimethylamino)-3,5-dimethyl-thiazolo[4,5-d]pyrimidine-2-thione::MLS000119219::SMR000096143::cid_718518
SMILES CN(C)c1nc(C)nc2n(C)c(=S)sc12
InChI Key InChIKey=IZBCYVNWUBEPQG-UHFFFAOYSA-N
Data  1 IC50
  Tab Delimited (TSV)   2D SDfile   Computed 3D by Vconf -m prep SDfile
Find this compound or compounds like it in BindingDB:
Activity Spreadsheet -- Enzyme Inhibition Constant Data from BindingDB
Found 1 hit for monomerid = 37457
TargetSphingosine 1-phosphate receptor 3(Homo sapiens (Human))
The Scripps Research Institute Molecular Screening Center
Curated by PubChem BioAssay
LigandPNGBDBM37457(7-(dimethylamino)-3,5-dimethyl-2-thiazolo[4,5-d]py...)
Affinity DataIC50: >4.98E+4nM. Assay description: Source (MLSCN Center Name): The Scripps Research Institute Molecular Screening Center Center Affiliation: The Scripps Research Institute, TSRI Assay ...
In DepthDetails PCBioAssay