BDBM374765 US10246467, Example I-57::US10919913, # I-57
SMILES C[C@H]1CC(C[C@@H]1C)N1[C@H]2COc3n(nc4cc(ccc34)C(O)=O)[C@H]2[C@H](c2cccc(Cl)c2F)[C@]11C(=O)Nc2cc(Cl)ccc12
InChI Key InChIKey=KPYXMBNMDIMBLZ-LTBSGKJHSA-N
Data  2 IC50
  Tab Delimited (TSV)   2D SDfile   Computed 3D by Vconf -m prep SDfile
Find this compound or compounds like it in BindingDB:
Activity Spreadsheet -- Enzyme Inhibition Constant Data from BindingDB
Found 2 hits for monomerid = 374765
TargetE3 ubiquitin-protein ligase Mdm2(Homo sapiens (Human))
Boehringer Ingelheim International
US Patent
LigandPNGBDBM374765(US10246467, Example I-57 | US10919913, # I-57)
Affinity DataIC50:  76nM. Assay description: This assay is used to determine whether the compounds inhibit the p53-MDM2 interaction and thus restore p53 function.15 μL of compound in 20% DM...
Ligand InfoPC cidPC sid
In DepthDetails US Patent
TargetCellular tumor antigen p53 [16-27]/E3 ubiquitin-protein ligase Mdm2 [23-117](Homo sapiens (Human))
Boehringer Ingelheim International
US Patent
LigandPNGBDBM374765(US10246467, Example I-57 | US10919913, # I-57)
Affinity DataIC50:  76nM. Assay description: This assay is used to determine whether the compounds inhibit the p53-MDM2 interaction and thus restore p53 function.15 μL of compound in 20% DM...
Ligand InfoPC cidPC sid
In DepthDetails US Patent