BDBM37544 1-[3-(1-cyano-2-isopropoxy-2-keto-ethyl)quinoxalin-2-yl]isonipecotic acid ethyl ester::1-[3-(1-cyano-2-oxo-2-propan-2-yloxyethyl)-2-quinoxalinyl]-4-piperidinecarboxylic acid ethyl ester::MLS000036468::SMR000042280::cid_661799::ethyl 1-[3-(1-cyano-2-oxidanylidene-2-propan-2-yloxy-ethyl)quinoxalin-2-yl]piperidine-4-carboxylate::ethyl 1-[3-(1-cyano-2-oxo-2-propan-2-yloxyethyl)quinoxalin-2-yl]piperidine-4-carboxylate
SMILES CCOC(=O)C1CCN(CC1)c1nc2ccccc2nc1C(C#N)C(=O)OC(C)C
InChI Key InChIKey=AQOREZNFLOCXGH-UHFFFAOYSA-N
Data  1 IC50
  Tab Delimited (TSV)   2D SDfile   Computed 3D by Vconf -m prep SDfile
Find this compound or compounds like it in BindingDB:
Activity Spreadsheet -- Enzyme Inhibition Constant Data from BindingDB
Found 1 hit for monomerid = 37544
TargetHuntingtin(Homo sapiens (Human))
Columbia University Molecular Screening Center
Curated by PubChem BioAssay
LigandPNGBDBM37544(1-[3-(1-cyano-2-isopropoxy-2-keto-ethyl)quinoxalin...)
Affinity DataIC50: >8.00E+3nM. Assay description: The mutation underlying Huntington's disease is an expansion of a polyglutamine tract in the N-terminus of the protein huntingtin (htt). Under no...
In DepthDetails PCBioAssay