BDBM37587 MLS000116342::N-(2-bromo-4,6-difluoro-phenyl)-5-cyclopropyl-isoxazole-3-carboxamide::N-(2-bromo-4,6-difluorophenyl)-5-cyclopropyl-1,2-oxazole-3-carboxamide::N-(2-bromo-4,6-difluorophenyl)-5-cyclopropyl-3-isoxazolecarboxamide::N-[2-bromanyl-4,6-bis(fluoranyl)phenyl]-5-cyclopropyl-1,2-oxazole-3-carboxamide::SMR000093319::cid_5308390
SMILES Fc1cc(F)c(NC(=O)c2cc(on2)C2CC2)c(Br)c1
InChI Key InChIKey=LGUWQIBEXYYXRO-UHFFFAOYSA-N
Data  2 IC50
  Tab Delimited (TSV)   2D SDfile   Computed 3D by Vconf -m prep SDfile
Find this compound or compounds like it in BindingDB:
Activity Spreadsheet -- Enzyme Inhibition Constant Data from BindingDB
Found 2 hits for monomerid = 37587
TargetKallikrein-5(Homo sapiens (Human))
Pcmd
Curated by PubChem BioAssay
LigandPNGBDBM37587(MLS000116342 | N-(2-bromo-4,6-difluoro-phenyl)-5-c...)
Affinity DataIC50:  5.00E+4nM. Assay description: Molecular Library Screening Center Network (MLSCN) Penn Center for Molecular Discovery (PCMD) Assay Provider: Scott L. Diamond, University of Pennsy...
In DepthDetails PCBioAssay
TargetHuntingtin(Homo sapiens (Human))
Columbia University Molecular Screening Center
Curated by PubChem BioAssay
LigandPNGBDBM37587(MLS000116342 | N-(2-bromo-4,6-difluoro-phenyl)-5-c...)
Affinity DataIC50: >8.00E+3nM. Assay description: The mutation underlying Huntington's disease is an expansion of a polyglutamine tract in the N-terminus of the protein huntingtin (htt). Under no...
In DepthDetails PCBioAssay