BDBM37649 2-(4-bromophenyl)-3-(furan-2-carbonyl)-4-hydroxy-1-(3-methoxypropyl)-2H-pyrrol-5-one::2-(4-bromophenyl)-3-(furan-2-ylcarbonyl)-1-(3-methoxypropyl)-4-oxidanyl-2H-pyrrol-5-one::2-(4-bromophenyl)-3-[2-furanyl(oxo)methyl]-4-hydroxy-1-(3-methoxypropyl)-2H-pyrrol-5-one::5-(4-bromophenyl)-4-(2-furoyl)-3-hydroxy-1-(3-methoxypropyl)-3-pyrrolin-2-one::MLS000036754::SMR000058000::cid_661728
SMILES COCCCN1C(C(C(=O)c2ccco2)C(=O)C1=O)c1ccc(Br)cc1
InChI Key InChIKey=XLNPZLLONVGLIP-UHFFFAOYSA-N
Data  2 KI  2 IC50
  Tab Delimited (TSV)   2D SDfile   Computed 3D by Vconf -m prep SDfile
Find this compound or compounds like it in BindingDB:
Activity Spreadsheet -- Enzyme Inhibition Constant Data from BindingDB
Found 4 hits for monomerid = 37649
TargetfMet-Leu-Phe receptor(Homo sapiens (Human))
Nmmlsc
Curated by PubChem BioAssay
LigandPNGBDBM37649(2-(4-bromophenyl)-3-(furan-2-carbonyl)-4-hydroxy-1...)
Affinity DataKi:  9.60E+3nM. Assay description: University of New Mexico Assay Overview: Assay Support: NIH 1R03MH076381-01 Assay for Formylpeptide Receptor Family Ligands PI: Bruce S. Edwards, Ph...
In DepthDetails PCBioAssay
TargetN-formyl peptide receptor 2(Homo sapiens (Human))
Nmmlsc
Curated by PubChem BioAssay
LigandPNGBDBM37649(2-(4-bromophenyl)-3-(furan-2-carbonyl)-4-hydroxy-1...)
Affinity DataKi: >4.03E+4nM. Assay description: University of New Mexico Assay Overview Assay Support: NIH 1R03MH076381-01 Assay for Formylpeptide Receptor Family Ligands PI: Bruce S. Edwards, Ph....
In DepthDetails PCBioAssay
TargetN-formyl peptide receptor 2(Homo sapiens (Human))
Nmmlsc
Curated by PubChem BioAssay
LigandPNGBDBM37649(2-(4-bromophenyl)-3-(furan-2-carbonyl)-4-hydroxy-1...)
Affinity DataIC50: >6.67E+4nM. Assay description: University of New Mexico Assay Overview Assay Support: NIH 1R03MH076381-01 Assay for Formylpeptide Receptor Family Ligands PI: Bruce S. Edwards, Ph....
In DepthDetails PCBioAssay
TargetfMet-Leu-Phe receptor(Homo sapiens (Human))
Nmmlsc
Curated by PubChem BioAssay
LigandPNGBDBM37649(2-(4-bromophenyl)-3-(furan-2-carbonyl)-4-hydroxy-1...)
Affinity DataIC50:  1.47E+4nM. Assay description: University of New Mexico Assay Overview: Assay Support: NIH 1R03MH076381-01 Assay for Formylpeptide Receptor Family Ligands PI: Bruce S. Edwards, Ph...
In DepthDetails PCBioAssay