BDBM37698 3-(4-carboxyhexanoylamino)benzoic acid::3-[(4-carboxy-1-oxohexyl)amino]benzoic acid::3-[(4-carboxyhexanoyl)amino]benzoic acid::MLS000090261::SMR000024871::cid_3237482
SMILES CCC(CCC(=O)Nc1cccc(c1)C(O)=O)C(O)=O
InChI Key InChIKey=YTWWJFHXEWQKLX-UHFFFAOYSA-N
Data  2 KI  2 IC50
  Tab Delimited (TSV)   2D SDfile   Computed 3D by Vconf -m prep SDfile
Find this compound or compounds like it in BindingDB:
Activity Spreadsheet -- Enzyme Inhibition Constant Data from BindingDB
Found 4 hits for monomerid = 37698
TargetN-formyl peptide receptor 2(Homo sapiens (Human))
Nmmlsc
Curated by PubChem BioAssay
LigandPNGBDBM37698(3-(4-carboxyhexanoylamino)benzoic acid | 3-[(4-car...)
Affinity DataKi: >4.03E+4nM. Assay description: University of New Mexico Assay Overview Assay Support: NIH 1R03MH076381-01 Assay for Formylpeptide Receptor Family Ligands PI: Bruce S. Edwards, Ph....
In DepthDetails PCBioAssay
TargetfMet-Leu-Phe receptor(Homo sapiens (Human))
Nmmlsc
Curated by PubChem BioAssay
LigandPNGBDBM37698(3-(4-carboxyhexanoylamino)benzoic acid | 3-[(4-car...)
Affinity DataKi: >4.37E+4nM. Assay description: University of New Mexico Assay Overview: Assay Support: NIH 1R03MH076381-01 Assay for Formylpeptide Receptor Family Ligands PI: Bruce S. Edwards, Ph...
In DepthDetails PCBioAssay
TargetN-formyl peptide receptor 2(Homo sapiens (Human))
Nmmlsc
Curated by PubChem BioAssay
LigandPNGBDBM37698(3-(4-carboxyhexanoylamino)benzoic acid | 3-[(4-car...)
Affinity DataIC50: >6.67E+4nM. Assay description: University of New Mexico Assay Overview Assay Support: NIH 1R03MH076381-01 Assay for Formylpeptide Receptor Family Ligands PI: Bruce S. Edwards, Ph....
In DepthDetails PCBioAssay
TargetfMet-Leu-Phe receptor(Homo sapiens (Human))
Nmmlsc
Curated by PubChem BioAssay
LigandPNGBDBM37698(3-(4-carboxyhexanoylamino)benzoic acid | 3-[(4-car...)
Affinity DataIC50: >6.67E+4nM. Assay description: University of New Mexico Assay Overview: Assay Support: NIH 1R03MH076381-01 Assay for Formylpeptide Receptor Family Ligands PI: Bruce S. Edwards, Ph...
In DepthDetails PCBioAssay