BDBM377177 5-Amino-N-{4-[3.4-cis-3-amino-4-hydroxypiperidin-1-yl]-6,7-dihydro-5H-cyclopenta[b]pyridin-3-yl}-2-(2,6-difluorophenyl)-1,3-thiazole-4-carboxamide (Enantiomer 2)::US10265307, Example 27::US10517858, Example 27::US10828290, Example 27::US11229631, Example 27
SMILES N[C@@H]1CN(CC[C@@H]1O)c1c2CCCc2ncc1NC(=O)c1nc(sc1N)-c1c(F)cccc1F
InChI Key InChIKey=QKMVVDJYGIYDRY-PBHICJAKSA-N
Data  12 IC50
  Tab Delimited (TSV)   2D SDfile   Computed 3D by Vconf -m prep SDfile
Find this compound or compounds like it in BindingDB:
Activity Spreadsheet -- Enzyme Inhibition Constant Data from BindingDB
Found 12 hits for monomerid = 377177
TargetSerine/threonine-protein kinase pim-1(Homo sapiens (Human))
Incyte
US Patent
LigandPNGBDBM377177(5-Amino-N-{4-[3.4-cis-3-amino-4-hydroxypiperidin-1...)
Affinity DataIC50: <100nM. Assay description: Pim-1 and Pim-3 kinase assays-20 μL reactions were run in white 384 well polystyrene plates dotted with 0.8 μL compound/DMSO in the assay b...
Ligand InfoPC cidPC sid
In DepthDetails US Patent
TargetSerine/threonine-protein kinase pim-2(Homo sapiens (Human))
Incyte
US Patent
LigandPNGBDBM377177(5-Amino-N-{4-[3.4-cis-3-amino-4-hydroxypiperidin-1...)
Affinity DataIC50: <100nM. Assay description: Pim-1 and Pim-3 kinase assays-20 μL reactions were run in white 384 well polystyrene plates dotted with 0.8 μL compound/DMSO in the assay b...
Ligand InfoPC cidPC sid
In DepthDetails US Patent
TargetSerine/threonine-protein kinase pim-3(Homo sapiens (Human))
Incyte
US Patent
LigandPNGBDBM377177(5-Amino-N-{4-[3.4-cis-3-amino-4-hydroxypiperidin-1...)
Affinity DataIC50: <100nM. Assay description: Pim-1 and Pim-3 kinase assays-20 μL reactions were run in white 384 well polystyrene plates dotted with 0.8 μL compound/DMSO in the assay b...
Ligand InfoPC cidPC sid
In DepthDetails US Patent
TargetSerine/threonine-protein kinase pim-1(Homo sapiens (Human))
Incyte
US Patent
LigandPNGBDBM377177(5-Amino-N-{4-[3.4-cis-3-amino-4-hydroxypiperidin-1...)
Affinity DataIC50: <100nM. Assay description: Pim-1 and Pim-3 kinase assays-20 μL reactions were run in white 384 well polystyrene plates dotted with 0.84 compound/DMSO in the assay buffer (...
Ligand InfoPC cidPC sid
In DepthDetails US Patent
TargetSerine/threonine-protein kinase pim-2(Homo sapiens (Human))
Incyte
US Patent
LigandPNGBDBM377177(5-Amino-N-{4-[3.4-cis-3-amino-4-hydroxypiperidin-1...)
Affinity DataIC50: <100nM. Assay description: Pim-2 kinase assay-20 μL reactions were run in white 384 well polystyrene plates dotted with 0.8 μL compound/DMSO in the assay buffer (50 m...
Ligand InfoPC cidPC sid
In DepthDetails US Patent
TargetSerine/threonine-protein kinase pim-3(Homo sapiens (Human))
Incyte
US Patent
LigandPNGBDBM377177(5-Amino-N-{4-[3.4-cis-3-amino-4-hydroxypiperidin-1...)
Affinity DataIC50: <100nM. Assay description: Pim-1 and Pim-3 kinase assays-20 μL reactions were run in white 384 well polystyrene plates dotted with 0.8 μL compound/DMSO in the assay b...
Ligand InfoPC cidPC sid
In DepthDetails US Patent
TargetSerine/threonine-protein kinase pim-1(Homo sapiens (Human))
Incyte
US Patent
LigandPNGBDBM377177(5-Amino-N-{4-[3.4-cis-3-amino-4-hydroxypiperidin-1...)
Affinity DataIC50: <100nM. Assay description: Pim-1 and Pim-3 kinase assays—20 μL reactions were run in white 384 well polystyrene plates dotted with 0.8 μcompound/DMSO in the assa...
Ligand InfoPC cidPC sid
In DepthDetails US Patent
TargetSerine/threonine-protein kinase pim-2(Homo sapiens (Human))
Incyte
US Patent
LigandPNGBDBM377177(5-Amino-N-{4-[3.4-cis-3-amino-4-hydroxypiperidin-1...)
Affinity DataIC50: <100nM. Assay description: Pim-1 and Pim-3 kinase assays—20 μL reactions were run in white 384 well polystyrene plates dotted with 0.8 μcompound/DMSO in the assa...
Ligand InfoPC cidPC sid
In DepthDetails US Patent
TargetSerine/threonine-protein kinase pim-3(Homo sapiens (Human))
Incyte
US Patent
LigandPNGBDBM377177(5-Amino-N-{4-[3.4-cis-3-amino-4-hydroxypiperidin-1...)
Affinity DataIC50: <100nM. Assay description: Pim-1 and Pim-3 kinase assays—20 μL reactions were run in white 384 well polystyrene plates dotted with 0.8 μcompound/DMSO in the assa...
Ligand InfoPC cidPC sid
In DepthDetails US Patent
TargetSerine/threonine-protein kinase pim-1(Homo sapiens (Human))
Incyte
US Patent
LigandPNGBDBM377177(5-Amino-N-{4-[3.4-cis-3-amino-4-hydroxypiperidin-1...)
Affinity DataIC50: <100nM. Assay description: Pim-1 and Pim-3 kinase assays-20 μL reactions were run in white 384 well polystyrene plates dotted with 0.8 μL compound/DMSO in the assay b...
Ligand InfoPC cidPC sid
In DepthDetails US Patent
TargetSerine/threonine-protein kinase pim-2(Homo sapiens (Human))
Incyte
US Patent
LigandPNGBDBM377177(5-Amino-N-{4-[3.4-cis-3-amino-4-hydroxypiperidin-1...)
Affinity DataIC50: <100nM. Assay description: Pim-2 kinase assay-20 μL reactions were run in white 384 well polystyrene plates dotted with 0.8 μL compound/DMSO in the assay buffer (50 m...
Ligand InfoPC cidPC sid
In DepthDetails US Patent
TargetSerine/threonine-protein kinase pim-3(Homo sapiens (Human))
Incyte
US Patent
LigandPNGBDBM377177(5-Amino-N-{4-[3.4-cis-3-amino-4-hydroxypiperidin-1...)
Affinity DataIC50: <100nM. Assay description: Pim-1 and Pim-3 kinase assays-20 μL reactions were run in white 384 well polystyrene plates dotted with 0.84 compound/DMSO in the assay buffer (...
Ligand InfoPC cidPC sid
In DepthDetails US Patent