BDBM377183 N-{4-[(3S)-3-Aminopiperidin-1-yl]-5,6,7,8-tetrahydro-1,8-naphthyridin-3-yl}-6-(2,6-difluorophenyl)-5-fluoropyridine-2-carboxamide::US10265307, Example 33::US10517858, Example 33::US10828290, Example 33::US11229631, Example 33
SMILES N[C@H]1CCCN(C1)c1c(NC(=O)c2ccc(F)c(n2)-c2c(F)cccc2F)cnc2NCCCc12
InChI Key InChIKey=NHSUMDPNMBEPJB-AWEZNQCLSA-N
Data  12 IC50
  Tab Delimited (TSV)   2D SDfile   Computed 3D by Vconf -m prep SDfile
Find this compound or compounds like it in BindingDB:
Activity Spreadsheet -- Enzyme Inhibition Constant Data from BindingDB
Found 12 hits for monomerid = 377183
TargetSerine/threonine-protein kinase pim-1(Homo sapiens (Human))
Incyte
US Patent
LigandPNGBDBM377183(N-{4-[(3S)-3-Aminopiperidin-1-yl]-5,6,7,8-tetrahyd...)
Affinity DataIC50: <100nM. Assay description: Pim-1 and Pim-3 kinase assays-20 μL reactions were run in white 384 well polystyrene plates dotted with 0.8 μL compound/DMSO in the assay b...
Ligand InfoPC cidPC sid
In DepthDetails US Patent
TargetSerine/threonine-protein kinase pim-2(Homo sapiens (Human))
Incyte
US Patent
LigandPNGBDBM377183(N-{4-[(3S)-3-Aminopiperidin-1-yl]-5,6,7,8-tetrahyd...)
Affinity DataIC50:  550nM. Assay description: Pim-1 and Pim-3 kinase assays-20 μL reactions were run in white 384 well polystyrene plates dotted with 0.8 μL compound/DMSO in the assay b...
Ligand InfoPC cidPC sid
In DepthDetails US Patent
TargetSerine/threonine-protein kinase pim-3(Homo sapiens (Human))
Incyte
US Patent
LigandPNGBDBM377183(N-{4-[(3S)-3-Aminopiperidin-1-yl]-5,6,7,8-tetrahyd...)
Affinity DataIC50: <100nM. Assay description: Pim-1 and Pim-3 kinase assays-20 μL reactions were run in white 384 well polystyrene plates dotted with 0.8 μL compound/DMSO in the assay b...
Ligand InfoPC cidPC sid
In DepthDetails US Patent
TargetSerine/threonine-protein kinase pim-1(Homo sapiens (Human))
Incyte
US Patent
LigandPNGBDBM377183(N-{4-[(3S)-3-Aminopiperidin-1-yl]-5,6,7,8-tetrahyd...)
Affinity DataIC50: <100nM. Assay description: Pim-1 and Pim-3 kinase assays-20 μL reactions were run in white 384 well polystyrene plates dotted with 0.84 compound/DMSO in the assay buffer (...
Ligand InfoPC cidPC sid
In DepthDetails US Patent
TargetSerine/threonine-protein kinase pim-2(Homo sapiens (Human))
Incyte
US Patent
LigandPNGBDBM377183(N-{4-[(3S)-3-Aminopiperidin-1-yl]-5,6,7,8-tetrahyd...)
Affinity DataIC50:  550nM. Assay description: Pim-2 kinase assay-20 μL reactions were run in white 384 well polystyrene plates dotted with 0.8 μL compound/DMSO in the assay buffer (50 m...
Ligand InfoPC cidPC sid
In DepthDetails US Patent
TargetSerine/threonine-protein kinase pim-3(Homo sapiens (Human))
Incyte
US Patent
LigandPNGBDBM377183(N-{4-[(3S)-3-Aminopiperidin-1-yl]-5,6,7,8-tetrahyd...)
Affinity DataIC50: <100nM. Assay description: Pim-1 and Pim-3 kinase assays-20 μL reactions were run in white 384 well polystyrene plates dotted with 0.8 μL compound/DMSO in the assay b...
Ligand InfoPC cidPC sid
In DepthDetails US Patent
TargetSerine/threonine-protein kinase pim-1(Homo sapiens (Human))
Incyte
US Patent
LigandPNGBDBM377183(N-{4-[(3S)-3-Aminopiperidin-1-yl]-5,6,7,8-tetrahyd...)
Affinity DataIC50: <100nM. Assay description: Pim-1 and Pim-3 kinase assays—20 μL reactions were run in white 384 well polystyrene plates dotted with 0.8 μcompound/DMSO in the assa...
Ligand InfoPC cidPC sid
In DepthDetails US Patent
TargetSerine/threonine-protein kinase pim-2(Homo sapiens (Human))
Incyte
US Patent
LigandPNGBDBM377183(N-{4-[(3S)-3-Aminopiperidin-1-yl]-5,6,7,8-tetrahyd...)
Affinity DataIC50:  550nM. Assay description: Pim-1 and Pim-3 kinase assays—20 μL reactions were run in white 384 well polystyrene plates dotted with 0.8 μcompound/DMSO in the assa...
Ligand InfoPC cidPC sid
In DepthDetails US Patent
TargetSerine/threonine-protein kinase pim-3(Homo sapiens (Human))
Incyte
US Patent
LigandPNGBDBM377183(N-{4-[(3S)-3-Aminopiperidin-1-yl]-5,6,7,8-tetrahyd...)
Affinity DataIC50: <100nM. Assay description: Pim-1 and Pim-3 kinase assays—20 μL reactions were run in white 384 well polystyrene plates dotted with 0.8 μcompound/DMSO in the assa...
Ligand InfoPC cidPC sid
In DepthDetails US Patent
TargetSerine/threonine-protein kinase pim-1(Homo sapiens (Human))
Incyte
US Patent
LigandPNGBDBM377183(N-{4-[(3S)-3-Aminopiperidin-1-yl]-5,6,7,8-tetrahyd...)
Affinity DataIC50: <100nM. Assay description: Pim-1 and Pim-3 kinase assays-20 μL reactions were run in white 384 well polystyrene plates dotted with 0.8 μL compound/DMSO in the assay b...
Ligand InfoPC cidPC sid
In DepthDetails US Patent
TargetSerine/threonine-protein kinase pim-2(Homo sapiens (Human))
Incyte
US Patent
LigandPNGBDBM377183(N-{4-[(3S)-3-Aminopiperidin-1-yl]-5,6,7,8-tetrahyd...)
Affinity DataIC50:  550nM. Assay description: Pim-2 kinase assay-20 μL reactions were run in white 384 well polystyrene plates dotted with 0.8 μL compound/DMSO in the assay buffer (50 m...
Ligand InfoPC cidPC sid
In DepthDetails US Patent
TargetSerine/threonine-protein kinase pim-3(Homo sapiens (Human))
Incyte
US Patent
LigandPNGBDBM377183(N-{4-[(3S)-3-Aminopiperidin-1-yl]-5,6,7,8-tetrahyd...)
Affinity DataIC50: <100nM. Assay description: Pim-1 and Pim-3 kinase assays-20 μL reactions were run in white 384 well polystyrene plates dotted with 0.84 compound/DMSO in the assay buffer (...
Ligand InfoPC cidPC sid
In DepthDetails US Patent