BDBM377186 5-Amino-N-{4-[(3S,5R)-3-amino-5-methylpiperidin-1-yl]-2,3-dihydrofuro[2,3-b]pyridin-5-yl}-2-(2,6-difluorophenyl)-1,3-thiazole-4-carboxamide::US10265307, Example 36::US10517858, Example 36::US10828290, Example 36::US11229631, Example 36
SMILES C[C@@H]1C[C@H](N)CN(C1)c1c2CCOc2ncc1NC(=O)c1nc(sc1N)-c1c(F)cccc1F
InChI Key InChIKey=VSCVRXUYBNPNAU-NEPJUHHUSA-N
Data  12 IC50
  Tab Delimited (TSV)   2D SDfile   Computed 3D by Vconf -m prep SDfile
Find this compound or compounds like it in BindingDB:
Activity Spreadsheet -- Enzyme Inhibition Constant Data from BindingDB
Found 12 hits for monomerid = 377186
TargetSerine/threonine-protein kinase pim-1(Homo sapiens (Human))
Incyte
US Patent
LigandPNGBDBM377186(5-Amino-N-{4-[(3S,5R)-3-amino-5-methylpiperidin-1-...)
Affinity DataIC50: <100nM. Assay description: Pim-1 and Pim-3 kinase assays-20 μL reactions were run in white 384 well polystyrene plates dotted with 0.8 μL compound/DMSO in the assay b...
Ligand InfoPC cidPC sid
In DepthDetails US Patent
TargetSerine/threonine-protein kinase pim-2(Homo sapiens (Human))
Incyte
US Patent
LigandPNGBDBM377186(5-Amino-N-{4-[(3S,5R)-3-amino-5-methylpiperidin-1-...)
Affinity DataIC50: <100nM. Assay description: Pim-1 and Pim-3 kinase assays-20 μL reactions were run in white 384 well polystyrene plates dotted with 0.8 μL compound/DMSO in the assay b...
Ligand InfoPC cidPC sid
In DepthDetails US Patent
TargetSerine/threonine-protein kinase pim-3(Homo sapiens (Human))
Incyte
US Patent
LigandPNGBDBM377186(5-Amino-N-{4-[(3S,5R)-3-amino-5-methylpiperidin-1-...)
Affinity DataIC50: <100nM. Assay description: Pim-1 and Pim-3 kinase assays-20 μL reactions were run in white 384 well polystyrene plates dotted with 0.8 μL compound/DMSO in the assay b...
Ligand InfoPC cidPC sid
In DepthDetails US Patent
TargetSerine/threonine-protein kinase pim-1(Homo sapiens (Human))
Incyte
US Patent
LigandPNGBDBM377186(5-Amino-N-{4-[(3S,5R)-3-amino-5-methylpiperidin-1-...)
Affinity DataIC50: <100nM. Assay description: Pim-1 and Pim-3 kinase assays-20 μL reactions were run in white 384 well polystyrene plates dotted with 0.84 compound/DMSO in the assay buffer (...
Ligand InfoPC cidPC sid
In DepthDetails US Patent
TargetSerine/threonine-protein kinase pim-2(Homo sapiens (Human))
Incyte
US Patent
LigandPNGBDBM377186(5-Amino-N-{4-[(3S,5R)-3-amino-5-methylpiperidin-1-...)
Affinity DataIC50: <100nM. Assay description: Pim-2 kinase assay-20 μL reactions were run in white 384 well polystyrene plates dotted with 0.8 μL compound/DMSO in the assay buffer (50 m...
Ligand InfoPC cidPC sid
In DepthDetails US Patent
TargetSerine/threonine-protein kinase pim-3(Homo sapiens (Human))
Incyte
US Patent
LigandPNGBDBM377186(5-Amino-N-{4-[(3S,5R)-3-amino-5-methylpiperidin-1-...)
Affinity DataIC50: <100nM. Assay description: Pim-1 and Pim-3 kinase assays-20 μL reactions were run in white 384 well polystyrene plates dotted with 0.8 μL compound/DMSO in the assay b...
Ligand InfoPC cidPC sid
In DepthDetails US Patent
TargetSerine/threonine-protein kinase pim-1(Homo sapiens (Human))
Incyte
US Patent
LigandPNGBDBM377186(5-Amino-N-{4-[(3S,5R)-3-amino-5-methylpiperidin-1-...)
Affinity DataIC50: <100nM. Assay description: Pim-1 and Pim-3 kinase assays—20 μL reactions were run in white 384 well polystyrene plates dotted with 0.8 μcompound/DMSO in the assa...
Ligand InfoPC cidPC sid
In DepthDetails US Patent
TargetSerine/threonine-protein kinase pim-2(Homo sapiens (Human))
Incyte
US Patent
LigandPNGBDBM377186(5-Amino-N-{4-[(3S,5R)-3-amino-5-methylpiperidin-1-...)
Affinity DataIC50: <100nM. Assay description: Pim-1 and Pim-3 kinase assays—20 μL reactions were run in white 384 well polystyrene plates dotted with 0.8 μcompound/DMSO in the assa...
Ligand InfoPC cidPC sid
In DepthDetails US Patent
TargetSerine/threonine-protein kinase pim-3(Homo sapiens (Human))
Incyte
US Patent
LigandPNGBDBM377186(5-Amino-N-{4-[(3S,5R)-3-amino-5-methylpiperidin-1-...)
Affinity DataIC50: <100nM. Assay description: Pim-1 and Pim-3 kinase assays—20 μL reactions were run in white 384 well polystyrene plates dotted with 0.8 μcompound/DMSO in the assa...
Ligand InfoPC cidPC sid
In DepthDetails US Patent
TargetSerine/threonine-protein kinase pim-1(Homo sapiens (Human))
Incyte
US Patent
LigandPNGBDBM377186(5-Amino-N-{4-[(3S,5R)-3-amino-5-methylpiperidin-1-...)
Affinity DataIC50: <100nM. Assay description: Pim-1 and Pim-3 kinase assays-20 μL reactions were run in white 384 well polystyrene plates dotted with 0.8 μL compound/DMSO in the assay b...
Ligand InfoPC cidPC sid
In DepthDetails US Patent
TargetSerine/threonine-protein kinase pim-2(Homo sapiens (Human))
Incyte
US Patent
LigandPNGBDBM377186(5-Amino-N-{4-[(3S,5R)-3-amino-5-methylpiperidin-1-...)
Affinity DataIC50: <100nM. Assay description: Pim-2 kinase assay-20 μL reactions were run in white 384 well polystyrene plates dotted with 0.8 μL compound/DMSO in the assay buffer (50 m...
Ligand InfoPC cidPC sid
In DepthDetails US Patent
TargetSerine/threonine-protein kinase pim-3(Homo sapiens (Human))
Incyte
US Patent
LigandPNGBDBM377186(5-Amino-N-{4-[(3S,5R)-3-amino-5-methylpiperidin-1-...)
Affinity DataIC50: <100nM. Assay description: Pim-1 and Pim-3 kinase assays-20 μL reactions were run in white 384 well polystyrene plates dotted with 0.84 compound/DMSO in the assay buffer (...
Ligand InfoPC cidPC sid
In DepthDetails US Patent