BDBM377807 5-amino-1-(1-cyanopiperidin-3-yl)- 3-[3-(4-isopropyl-3- methylphenoxy)phenyl]-1H- pyrazole-4-carboxamide::US10266513, Example 101::US10815213, Example 101
SMILES CC(C)c1ccc(Oc2cccc(c2)-c2nn(C3CCCN(C3)C#N)c(N)c2C(N)=O)cc1C
InChI Key InChIKey=DTTHMJPVDYBKKU-UHFFFAOYSA-N
Data  2 IC50
  Tab Delimited (TSV)   2D SDfile   Computed 3D by Vconf -m prep SDfile
Find this compound or compounds like it in BindingDB:
Activity Spreadsheet -- Enzyme Inhibition Constant Data from BindingDB
Found 2 hits for monomerid = 377807
TargetTyrosine-protein kinase BTK(Homo sapiens (Human))
Pfizer
US Patent
LigandPNGBDBM377807(5-amino-1-(1-cyanopiperidin-3-yl)- 3-[3-(4-isoprop...)
Affinity DataIC50:  5.30nM. Assay description: BTK: TR-FRET LanthaScreen assays were performed by incubating a dilution series of inhibitor concentrations with 50 μM ATP, 100 nM FAM-Srctide p...
Ligand InfoPC cidPC sid
In DepthDetails US Patent
TargetTyrosine-protein kinase BTK(Homo sapiens (Human))
Pfizer
US Patent
LigandPNGBDBM377807(5-amino-1-(1-cyanopiperidin-3-yl)- 3-[3-(4-isoprop...)
Affinity DataIC50:  5.30nM. Assay description: TR-FRET LanthaScreen assays were performed by incubating a dilution series of inhibitor concentrations with 50 μM ATP, 100 nM FAM-Srctide peptid...
Ligand InfoPC cidPC sid
In DepthDetails US Patent