BDBM377817 5-amino-1-(1-cyanopiperidin-3-yl)-3-{4-[(5-fluoropyridin-2-yl)oxy]phenyl}-1H-pyrazole-4-carboxamide::US10266513, Example 111::US10815213, Example 111
SMILES NC(=O)c1c(N)n(nc1-c1ccc(Oc2ccc(F)cn2)cc1)C1CCCN(C1)C#N
InChI Key InChIKey=BENNFASJOSJLCV-UHFFFAOYSA-N
Data  2 IC50
  Tab Delimited (TSV)   2D SDfile   Computed 3D by Vconf -m prep SDfile
Find this compound or compounds like it in BindingDB:
Activity Spreadsheet -- Enzyme Inhibition Constant Data from BindingDB
Found 2 hits for monomerid = 377817
TargetTyrosine-protein kinase BTK(Homo sapiens (Human))
Pfizer
US Patent
LigandPNGBDBM377817(5-amino-1-(1-cyanopiperidin-3-yl)-3-{4-[(5-fluorop...)
Affinity DataIC50:  119nM. Assay description: BTK: TR-FRET LanthaScreen assays were performed by incubating a dilution series of inhibitor concentrations with 50 μM ATP, 100 nM FAM-Srctide p...
Ligand InfoPC cidPC sid
In DepthDetails US Patent
TargetTyrosine-protein kinase BTK(Homo sapiens (Human))
Pfizer
US Patent
LigandPNGBDBM377817(5-amino-1-(1-cyanopiperidin-3-yl)-3-{4-[(5-fluorop...)
Affinity DataIC50:  119nM. Assay description: TR-FRET LanthaScreen assays were performed by incubating a dilution series of inhibitor concentrations with 50 μM ATP, 100 nM FAM-Srctide peptid...
Ligand InfoPC cidPC sid
In DepthDetails US Patent