BDBM377830 5-amino-3-{4-[(4-chlorophenyl)thio]phenyl}-1-(1-cyanopiperidin-3-yl)-1H-pyrazole-4-carboxamide::US10266513, Example 124::US10815213, Example 124
SMILES NC(=O)c1c(N)n(nc1-c1ccc(Sc2ccc(Cl)cc2)cc1)C1CCCN(C1)C#N
InChI Key InChIKey=LYZOFLRZHWIWNV-UHFFFAOYSA-N
Data  2 IC50
  Tab Delimited (TSV)   2D SDfile   Computed 3D by Vconf -m prep SDfile
Find this compound or compounds like it in BindingDB:
Activity Spreadsheet -- Enzyme Inhibition Constant Data from BindingDB
Found 2 hits for monomerid = 377830
TargetTyrosine-protein kinase BTK(Homo sapiens (Human))
Pfizer
US Patent
LigandPNGBDBM377830(5-amino-3-{4-[(4-chlorophenyl)thio]phenyl}-1-(1-cy...)
Affinity DataIC50:  0.740nM. Assay description: BTK: TR-FRET LanthaScreen assays were performed by incubating a dilution series of inhibitor concentrations with 50 μM ATP, 100 nM FAM-Srctide p...
Ligand InfoPC cidPC sid
In DepthDetails US Patent
TargetTyrosine-protein kinase BTK(Homo sapiens (Human))
Pfizer
US Patent
LigandPNGBDBM377830(5-amino-3-{4-[(4-chlorophenyl)thio]phenyl}-1-(1-cy...)
Affinity DataIC50:  0.740nM. Assay description: TR-FRET LanthaScreen assays were performed by incubating a dilution series of inhibitor concentrations with 50 μM ATP, 100 nM FAM-Srctide peptid...
Ligand InfoPC cidPC sid
In DepthDetails US Patent