BDBM377844 5-amino-3-[4-(2,4-difluorophenoxy)phenyl]-1-{(3R)-1-[(2E)-4-methoxybut-2-enoyl]piperidin-3-yl}-1H-pyrazole-4-carboxamide::US10266513, Example 138::US10815213, Example 138
SMILES COC\C=C\C(=O)N1CCCC(C1)n1nc(c(C(N)=O)c1N)-c1ccc(Oc2ccc(F)cc2F)cc1
InChI Key InChIKey=LIXHAEVWXCBABZ-HWKANZROSA-N
Data  2 IC50
  Tab Delimited (TSV)   2D SDfile   Computed 3D by Vconf -m prep SDfile
Find this compound or compounds like it in BindingDB:
Activity Spreadsheet -- Enzyme Inhibition Constant Data from BindingDB
Found 2 hits for monomerid = 377844
TargetTyrosine-protein kinase BTK(Homo sapiens (Human))
Pfizer
US Patent
LigandPNGBDBM377844(5-amino-3-[4-(2,4-difluorophenoxy)phenyl]-1-{(3R)-...)
Affinity DataIC50:  21.8nM. Assay description: BTK: TR-FRET LanthaScreen assays were performed by incubating a dilution series of inhibitor concentrations with 50 μM ATP, 100 nM FAM-Srctide p...
Ligand InfoPC cidPC sid
In DepthDetails US Patent
TargetTyrosine-protein kinase BTK(Homo sapiens (Human))
Pfizer
US Patent
LigandPNGBDBM377844(5-amino-3-[4-(2,4-difluorophenoxy)phenyl]-1-{(3R)-...)
Affinity DataIC50:  21.8nM. Assay description: TR-FRET LanthaScreen assays were performed by incubating a dilution series of inhibitor concentrations with 50 μM ATP, 100 nM FAM-Srctide peptid...
Ligand InfoPC cidPC sid
In DepthDetails US Patent