BDBM37824 4-(1-adamantyl)-1,2-diphenyl-pyrazolidine-3,5-dione::4-(1-adamantyl)-1,2-diphenyl-pyrazolidine-3,5-quinone::4-(1-adamantyl)-1,2-diphenylpyrazolidine-3,5-dione::4-Adamantan-1-yl-1,2-diphenyl-pyrazolidine-3,5-dione::MLS000526352::SMR000116826::cid_2831216
SMILES [H]C12CC3([H])CC([H])(C1)CC(C2)(C3)c1c(O)n(-c2ccccc2)n(-c2ccccc2)c1=O
InChI Key InChIKey=QWYDJZBKFVKECI-UHFFFAOYSA-N
Data  2 KI  2 IC50
  Tab Delimited (TSV)   2D SDfile   Computed 3D by Vconf -m prep SDfile
Find this compound or compounds like it in BindingDB:
Activity Spreadsheet -- Enzyme Inhibition Constant Data from BindingDB
Found 4 hits for monomerid = 37824
TargetfMet-Leu-Phe receptor(Homo sapiens (Human))
Nmmlsc
Curated by PubChem BioAssay
LigandPNGBDBM37824(4-(1-adamantyl)-1,2-diphenyl-pyrazolidine-3,5-dion...)
Affinity DataKi:  7.50E+3nM. Assay description: University of New Mexico Assay Overview: Assay Support: NIH 1R03MH076381-01 Assay for Formylpeptide Receptor Family Ligands PI: Bruce S. Edwards, Ph...
In DepthDetails PCBioAssay
TargetN-formyl peptide receptor 2(Homo sapiens (Human))
Nmmlsc
Curated by PubChem BioAssay
LigandPNGBDBM37824(4-(1-adamantyl)-1,2-diphenyl-pyrazolidine-3,5-dion...)
Affinity DataKi: >4.03E+4nM. Assay description: University of New Mexico Assay Overview Assay Support: NIH 1R03MH076381-01 Assay for Formylpeptide Receptor Family Ligands PI: Bruce S. Edwards, Ph....
In DepthDetails PCBioAssay
TargetN-formyl peptide receptor 2(Homo sapiens (Human))
Nmmlsc
Curated by PubChem BioAssay
LigandPNGBDBM37824(4-(1-adamantyl)-1,2-diphenyl-pyrazolidine-3,5-dion...)
Affinity DataIC50: >6.67E+4nM. Assay description: University of New Mexico Assay Overview Assay Support: NIH 1R03MH076381-01 Assay for Formylpeptide Receptor Family Ligands PI: Bruce S. Edwards, Ph....
In DepthDetails PCBioAssay
TargetfMet-Leu-Phe receptor(Homo sapiens (Human))
Nmmlsc
Curated by PubChem BioAssay
LigandPNGBDBM37824(4-(1-adamantyl)-1,2-diphenyl-pyrazolidine-3,5-dion...)
Affinity DataIC50:  1.15E+4nM. Assay description: University of New Mexico Assay Overview: Assay Support: NIH 1R03MH076381-01 Assay for Formylpeptide Receptor Family Ligands PI: Bruce S. Edwards, Ph...
In DepthDetails PCBioAssay