BDBM37834 3-amino-4-(4-methylanilino)benzoic acid::3-amino-4-(p-toluidino)benzoic acid::3-amino-4-[(4-methylphenyl)amino]benzoic acid::3-azanyl-4-[(4-methylphenyl)amino]benzoic acid::MLS000530368::SMR000135345::cid_871516
SMILES Cc1ccc(Nc2ccc(cc2N)C(O)=O)cc1
InChI Key InChIKey=QPOSHSVKLMHDCD-UHFFFAOYSA-N
Data  2 KI  2 IC50  1 EC50
  Tab Delimited (TSV)   2D SDfile   Computed 3D by Vconf -m prep SDfile
Find this compound or compounds like it in BindingDB:
Activity Spreadsheet -- Enzyme Inhibition Constant Data from BindingDB
Found 5 hits for monomerid = 37834
TargetN-formyl peptide receptor 2(Homo sapiens (Human))
Nmmlsc
Curated by PubChem BioAssay
LigandPNGBDBM37834(3-amino-4-(4-methylanilino)benzoic acid | 3-amino-...)
Affinity DataKi: >4.03E+4nM. Assay description: University of New Mexico Assay Overview Assay Support: NIH 1R03MH076381-01 Assay for Formylpeptide Receptor Family Ligands PI: Bruce S. Edwards, Ph....
In DepthDetails PCBioAssay
TargetfMet-Leu-Phe receptor(Homo sapiens (Human))
Nmmlsc
Curated by PubChem BioAssay
LigandPNGBDBM37834(3-amino-4-(4-methylanilino)benzoic acid | 3-amino-...)
Affinity DataKi: >4.37E+4nM. Assay description: University of New Mexico Assay Overview: Assay Support: NIH 1R03MH076381-01 Assay for Formylpeptide Receptor Family Ligands PI: Bruce S. Edwards, Ph...
In DepthDetails PCBioAssay
TargetCorticotropin-releasing factor-binding protein(Homo sapiens (Human))
Burnham Center For Chemical Genomics
Curated by PubChem BioAssay
LigandPNGBDBM37834(3-amino-4-(4-methylanilino)benzoic acid | 3-amino-...)
Affinity DataEC50: >5.30E+4nM. Assay description: Data Source: Sanford-Burnham Center for Chemical Genomics (SBCCG) Source Affiliation: Sanford-Burnham Medical Research Institute (SBMRI, San Diego, C...
In DepthDetails PCBioAssay
TargetfMet-Leu-Phe receptor(Homo sapiens (Human))
Nmmlsc
Curated by PubChem BioAssay
LigandPNGBDBM37834(3-amino-4-(4-methylanilino)benzoic acid | 3-amino-...)
Affinity DataIC50: >6.67E+4nM. Assay description: University of New Mexico Assay Overview: Assay Support: NIH 1R03MH076381-01 Assay for Formylpeptide Receptor Family Ligands PI: Bruce S. Edwards, Ph...
In DepthDetails PCBioAssay
TargetN-formyl peptide receptor 2(Homo sapiens (Human))
Nmmlsc
Curated by PubChem BioAssay
LigandPNGBDBM37834(3-amino-4-(4-methylanilino)benzoic acid | 3-amino-...)
Affinity DataIC50: >6.67E+4nM. Assay description: University of New Mexico Assay Overview Assay Support: NIH 1R03MH076381-01 Assay for Formylpeptide Receptor Family Ligands PI: Bruce S. Edwards, Ph....
In DepthDetails PCBioAssay