BDBM37840 1-(2-methoxyethyl)-4-oxidanyl-2-phenyl-3-thiophen-2-ylcarbonyl-2H-pyrrol-5-one::3-Hydroxy-1-(2-methoxy-ethyl)-5-phenyl-4-(thiophene-2-carbonyl)-1,5-dihydro-pyrrol-2-one::3-hydroxy-1-(2-methoxyethyl)-5-phenyl-4-(2-thenoyl)-3-pyrrolin-2-one::4-hydroxy-1-(2-methoxyethyl)-2-phenyl-3-(thiophene-2-carbonyl)-2H-pyrrol-5-one::4-hydroxy-1-(2-methoxyethyl)-3-[oxo(thiophen-2-yl)methyl]-2-phenyl-2H-pyrrol-5-one::MLS000555442::SMR000147159::cid_3147557
SMILES COCCN1C(C(C(=O)c2cccs2)C(=O)C1=O)c1ccccc1
InChI Key InChIKey=GQHWBFUTRHTKQP-UHFFFAOYSA-N
Data  2 KI  2 IC50
  Tab Delimited (TSV)   2D SDfile   Computed 3D by Vconf -m prep SDfile
Find this compound or compounds like it in BindingDB:
Activity Spreadsheet -- Enzyme Inhibition Constant Data from BindingDB
Found 4 hits for monomerid = 37840
TargetN-formyl peptide receptor 2(Homo sapiens (Human))
Nmmlsc
Curated by PubChem BioAssay
LigandPNGBDBM37840(1-(2-methoxyethyl)-4-oxidanyl-2-phenyl-3-thiophen-...)
Affinity DataKi: >4.03E+4nM. Assay description: University of New Mexico Assay Overview Assay Support: NIH 1R03MH076381-01 Assay for Formylpeptide Receptor Family Ligands PI: Bruce S. Edwards, Ph....
In DepthDetails PCBioAssay
TargetfMet-Leu-Phe receptor(Homo sapiens (Human))
Nmmlsc
Curated by PubChem BioAssay
LigandPNGBDBM37840(1-(2-methoxyethyl)-4-oxidanyl-2-phenyl-3-thiophen-...)
Affinity DataKi: >4.37E+4nM. Assay description: University of New Mexico Assay Overview: Assay Support: NIH 1R03MH076381-01 Assay for Formylpeptide Receptor Family Ligands PI: Bruce S. Edwards, Ph...
In DepthDetails PCBioAssay
TargetN-formyl peptide receptor 2(Homo sapiens (Human))
Nmmlsc
Curated by PubChem BioAssay
LigandPNGBDBM37840(1-(2-methoxyethyl)-4-oxidanyl-2-phenyl-3-thiophen-...)
Affinity DataIC50: >6.67E+4nM. Assay description: University of New Mexico Assay Overview Assay Support: NIH 1R03MH076381-01 Assay for Formylpeptide Receptor Family Ligands PI: Bruce S. Edwards, Ph....
In DepthDetails PCBioAssay
TargetfMet-Leu-Phe receptor(Homo sapiens (Human))
Nmmlsc
Curated by PubChem BioAssay
LigandPNGBDBM37840(1-(2-methoxyethyl)-4-oxidanyl-2-phenyl-3-thiophen-...)
Affinity DataIC50: >6.67E+4nM. Assay description: University of New Mexico Assay Overview: Assay Support: NIH 1R03MH076381-01 Assay for Formylpeptide Receptor Family Ligands PI: Bruce S. Edwards, Ph...
In DepthDetails PCBioAssay