BDBM37850 (5-methoxy-2-tosyl-pyrazol-3-yl)amine::5-methoxy-2-(4-methylphenyl)sulfonyl-3-pyrazolamine::5-methoxy-2-(4-methylphenyl)sulfonyl-pyrazol-3-amine::5-methoxy-2-(4-methylphenyl)sulfonylpyrazol-3-amine::PC-0094918::PCMD-CC-MCM-11::cid_1093235
SMILES COc1cc(N)n(n1)S(=O)(=O)c1ccc(C)cc1
InChI Key InChIKey=IFMASGUIMIINER-UHFFFAOYSA-N
Data  1 IC50
  Tab Delimited (TSV)   2D SDfile   Computed 3D by Vconf -m prep SDfile
Find this compound or compounds like it in BindingDB:
Activity Spreadsheet -- Enzyme Inhibition Constant Data from BindingDB
Found 1 hit for monomerid = 37850
TargetCathepsin B(Homo sapiens (Human))
Pcmd
Curated by PubChem BioAssay
LigandPNGBDBM37850((5-methoxy-2-tosyl-pyrazol-3-yl)amine | 5-methoxy-...)
Affinity DataIC50: >5.00E+4nM. Assay description: Human liver cathepsin B (EC 3.4.22.1) is a lysosomal cysteine protease. There has been a recent resurgence of interest in cathepsin B due to research...
In DepthDetails PCBioAssay