BDBM37854 PC-0094932::PCMD-CC-MCM-16::[5-(diacetylamino)-1-(4-methoxyphenyl)sulfonylpyrazol-3-yl] acetate::[5-(diethanoylamino)-1-(4-methoxyphenyl)sulfonyl-pyrazol-3-yl] ethanoate::acetic acid [5-(diacetylamino)-1-(4-methoxyphenyl)sulfonyl-3-pyrazolyl] ester::acetic acid [5-(diacetylamino)-1-(4-methoxyphenyl)sulfonyl-pyrazol-3-yl] ester::cid_11834384
SMILES COc1ccc(cc1)S(=O)(=O)n1nc(OC(C)=O)cc1N(C(C)=O)C(C)=O
InChI Key InChIKey=DPTJVRNGHTYUQA-UHFFFAOYSA-N
Data  1 IC50
  Tab Delimited (TSV)   2D SDfile   Computed 3D by Vconf -m prep SDfile
Find this compound or compounds like it in BindingDB:
Activity Spreadsheet -- Enzyme Inhibition Constant Data from BindingDB
Found 1 hit for monomerid = 37854
TargetCathepsin B(Homo sapiens (Human))
Pcmd
Curated by PubChem BioAssay
LigandPNGBDBM37854(PC-0094932 | PCMD-CC-MCM-16 | [5-(diacetylamino)-1...)
Affinity DataIC50: >5.00E+4nM. Assay description: Human liver cathepsin B (EC 3.4.22.1) is a lysosomal cysteine protease. There has been a recent resurgence of interest in cathepsin B due to research...
Ligand InfoPC cidPC sid
In DepthDetails PCBioAssay