BDBM37856 2-thiophenecarboxylic acid phenyl ester::PC-0094935::PCMD-CC-MCM-18::cid_573755::phenyl thiophene-2-carboxylate::thiophene-2-carboxylic acid phenyl ester
SMILES O=C(Oc1ccccc1)c1cccs1
InChI Key InChIKey=BUCUTHKQTIKRHI-UHFFFAOYSA-N
Data  1 IC50
  Tab Delimited (TSV)   2D SDfile   Computed 3D by Vconf -m prep SDfile
Find this compound or compounds like it in BindingDB:
Activity Spreadsheet -- Enzyme Inhibition Constant Data from BindingDB
Found 1 hit for monomerid = 37856
TargetCathepsin B(Homo sapiens (Human))
Pcmd
Curated by PubChem BioAssay
LigandPNGBDBM37856(2-thiophenecarboxylic acid phenyl ester | PC-00949...)
Affinity DataIC50: >5.00E+4nM. Assay description: Human liver cathepsin B (EC 3.4.22.1) is a lysosomal cysteine protease. There has been a recent resurgence of interest in cathepsin B due to research...
In DepthDetails PCBioAssay