BDBM37894 2-(1-benzimidazolyl)acetic acid [2-[(2-methoxy-3-dibenzofuranyl)amino]-2-oxoethyl] ester::2-(benzimidazol-1-yl)acetic acid [2-keto-2-[(2-methoxydibenzofuran-3-yl)amino]ethyl] ester::MLS000048523::SMR000062555::[2-[(2-methoxydibenzofuran-3-yl)amino]-2-oxidanylidene-ethyl] 2-(benzimidazol-1-yl)ethanoate::[2-[(2-methoxydibenzofuran-3-yl)amino]-2-oxoethyl] 2-(benzimidazol-1-yl)acetate::cid_2408812
SMILES COc1cc2c(cc1NC(=O)COC(=O)Cn1cnc3ccccc13)oc1ccccc21
InChI Key InChIKey=DRKCKBPPRFKHBP-UHFFFAOYSA-N
Data  1 IC50
  Tab Delimited (TSV)   2D SDfile   Computed 3D by Vconf -m prep SDfile
Find this compound or compounds like it in BindingDB:
Activity Spreadsheet -- Enzyme Inhibition Constant Data from BindingDB
Found 1 hit for monomerid = 37894
TargetcAMP-dependent protein kinase catalytic subunit alpha(Homo sapiens (Human))
The Scripps Research Institute Molecular Screening Center
Curated by PubChem BioAssay
LigandPNGBDBM37894(2-(1-benzimidazolyl)acetic acid [2-[(2-methoxy-3-d...)
Affinity DataIC50:  3.75E+4nM. Assay description: Source (MLSCN Center Name): The Scripps Research Institute Molecular Screening Center Center Affiliation: The Scripps Research Institute, TSRI Assay ...
In DepthDetails PCBioAssay