BDBM37895 4-pyridinecarboxylic acid [1-(3-chloroanilino)-1-oxopropan-2-yl] ester::MLS000048888::SMR000061623::[1-(3-chloroanilino)-1-oxopropan-2-yl] pyridine-4-carboxylate::[1-[(3-chlorophenyl)amino]-1-oxidanylidene-propan-2-yl] pyridine-4-carboxylate::cid_2998662::isonicotinic acid [2-(3-chloroanilino)-2-keto-1-methyl-ethyl] ester
SMILES CC(OC(=O)c1ccncc1)C(=O)Nc1cccc(Cl)c1
InChI Key InChIKey=BEJZJHXYWSWAQT-UHFFFAOYSA-N
Data  2 IC50
  Tab Delimited (TSV)   2D SDfile   Computed 3D by Vconf -m prep SDfile
Find this compound or compounds like it in BindingDB:
Activity Spreadsheet -- Enzyme Inhibition Constant Data from BindingDB
Found 2 hits for monomerid = 37895
TargetRho-associated protein kinase 2(Homo sapiens (Human))
The Scripps Research Institute Molecular Screening Center
Curated by PubChem BioAssay
LigandPNGBDBM37895(4-pyridinecarboxylic acid [1-(3-chloroanilino)-1-o...)
Affinity DataIC50:  5.45E+3nM. Assay description: Source (MLSCN Center Name): The Scripps Research Institute Molecular Screening Center Center Affiliation: The Scripps Research Institute, TSRI Assay ...
In DepthDetails PCBioAssay
TargetcAMP-dependent protein kinase catalytic subunit alpha(Homo sapiens (Human))
The Scripps Research Institute Molecular Screening Center
Curated by PubChem BioAssay
LigandPNGBDBM37895(4-pyridinecarboxylic acid [1-(3-chloroanilino)-1-o...)
Affinity DataIC50:  3.60E+4nM. Assay description: Source (MLSCN Center Name): The Scripps Research Institute Molecular Screening Center Center Affiliation: The Scripps Research Institute, TSRI Assay ...
In DepthDetails PCBioAssay