BDBM37903 6-(1-pyrrolidinyl)-7H-purine::6-pyrrolidin-1-yl-7H-purine::6-pyrrolidino-7H-purine::MLS000086553::SMR000015976::cid_756690
SMILES C1CCN(C1)c1ncnc2nc[nH]c12
InChI Key InChIKey=IQSRNEOAVVBNGN-UHFFFAOYSA-N
Data  1 IC50  1 EC50
  Tab Delimited (TSV)   2D SDfile   Computed 3D by Vconf -m prep SDfile
Find this compound or compounds like it in BindingDB:
Activity Spreadsheet -- Enzyme Inhibition Constant Data from BindingDB
Found 2 hits for monomerid = 37903
TargetSerine/threonine-protein kinase 33(Homo sapiens (Human))
Broad Institute
Curated by PubChem BioAssay
LigandPNGBDBM37903(6-(1-pyrrolidinyl)-7H-purine | 6-pyrrolidin-1-yl-7...)
Affinity DataEC50:  9.71E+3nM. Assay description: Keywords: STK33 Kinase, Non-ATP Competitive Inhibitor Assay Overview: Purified STK33 Kinase is preincubated with potential inhibitors and allowed to ...
In DepthDetails PCBioAssay
TargetcAMP-dependent protein kinase catalytic subunit alpha(Homo sapiens (Human))
The Scripps Research Institute Molecular Screening Center
Curated by PubChem BioAssay
LigandPNGBDBM37903(6-(1-pyrrolidinyl)-7H-purine | 6-pyrrolidin-1-yl-7...)
Affinity DataIC50:  3.56E+4nM. Assay description: Source (MLSCN Center Name): The Scripps Research Institute Molecular Screening Center Center Affiliation: The Scripps Research Institute, TSRI Assay ...
In DepthDetails PCBioAssay