BDBM37905 9-methyl-7-(2-pyridinyl)-5,6-dihydropyrazolo[3,4-h]quinazolin-2-amine::9-methyl-7-pyridin-2-yl-5,6-dihydropyrazolo[3,4-h]quinazolin-2-amine::9-methyl-7-pyridin-2-yl-6,7-dihydro-5H-pyrazolo[3,4-h]quinazolin-2-amine::MLS000085954::SMR000021283::[9-methyl-7-(2-pyridyl)-5,6-dihydropyrazolo[3,4-h]quinazolin-2-yl]amine::cid_712803
SMILES Cc1nn(c2CCc3cnc(N)nc3-c12)-c1ccccn1
InChI Key InChIKey=UHSQGNCGTFSTGC-UHFFFAOYSA-N
Data  2 IC50
  Tab Delimited (TSV)   2D SDfile   Computed 3D by Vconf -m prep SDfile
Find this compound or compounds like it in BindingDB:
Activity Spreadsheet -- Enzyme Inhibition Constant Data from BindingDB
Found 2 hits for monomerid = 37905
TargetRho-associated protein kinase 2(Homo sapiens (Human))
The Scripps Research Institute Molecular Screening Center
Curated by PubChem BioAssay
LigandPNGBDBM37905(9-methyl-7-(2-pyridinyl)-5,6-dihydropyrazolo[3,4-h...)
Affinity DataIC50: >1.99E+4nM. Assay description: Source (MLSCN Center Name): The Scripps Research Institute Molecular Screening Center Center Affiliation: The Scripps Research Institute, TSRI Assay ...
In DepthDetails PCBioAssay
TargetcAMP-dependent protein kinase catalytic subunit alpha(Homo sapiens (Human))
The Scripps Research Institute Molecular Screening Center
Curated by PubChem BioAssay
LigandPNGBDBM37905(9-methyl-7-(2-pyridinyl)-5,6-dihydropyrazolo[3,4-h...)
Affinity DataIC50:  5.48E+4nM. Assay description: Source (MLSCN Center Name): The Scripps Research Institute Molecular Screening Center Center Affiliation: The Scripps Research Institute, TSRI Assay ...
In DepthDetails PCBioAssay