BDBM37909 MLS000065989::N-(4-methyl-1,3-thiazol-2-yl)-2-[(5-pyridin-4-yl-1,3,4-oxadiazol-2-yl)sulfanyl]acetamide::N-(4-methyl-1,3-thiazol-2-yl)-2-[(5-pyridin-4-yl-1,3,4-oxadiazol-2-yl)sulfanyl]ethanamide::N-(4-methyl-1,3-thiazol-2-yl)-2-{[5-(4-pyridinyl)-1,3,4-oxadiazol-2-yl]thio}acetamide::N-(4-methyl-2-thiazolyl)-2-[(5-pyridin-4-yl-1,3,4-oxadiazol-2-yl)thio]acetamide::N-(4-methylthiazol-2-yl)-2-[[5-(4-pyridyl)-1,3,4-oxadiazol-2-yl]thio]acetamide::SMR000079407::cid_1263614
SMILES Cc1csc(NC(=O)CSc2nnc(o2)-c2ccncc2)n1
InChI Key InChIKey=VRRUXVDRYAOJMV-UHFFFAOYSA-N
Data  2 IC50
  Tab Delimited (TSV)   2D SDfile   Computed 3D by Vconf -m prep SDfile
Find this compound or compounds like it in BindingDB:
Activity Spreadsheet -- Enzyme Inhibition Constant Data from BindingDB
Found 2 hits for monomerid = 37909
TargetRho-associated protein kinase 2(Homo sapiens (Human))
The Scripps Research Institute Molecular Screening Center
Curated by PubChem BioAssay
LigandPNGBDBM37909(MLS000065989 | N-(4-methyl-1,3-thiazol-2-yl)-2-[(5...)
Affinity DataIC50:  1.86E+4nM. Assay description: Source (MLSCN Center Name): The Scripps Research Institute Molecular Screening Center Center Affiliation: The Scripps Research Institute, TSRI Assay ...
In DepthDetails PCBioAssay
TargetcAMP-dependent protein kinase catalytic subunit alpha(Homo sapiens (Human))
The Scripps Research Institute Molecular Screening Center
Curated by PubChem BioAssay
LigandPNGBDBM37909(MLS000065989 | N-(4-methyl-1,3-thiazol-2-yl)-2-[(5...)
Affinity DataIC50:  2.00E+4nM. Assay description: Source (MLSCN Center Name): The Scripps Research Institute Molecular Screening Center Center Affiliation: The Scripps Research Institute, TSRI Assay ...
In DepthDetails PCBioAssay