BDBM37912 7-benzo[e]perimidinone::7H-benzo[e]perimidin-7-one::MLS000097138::SMR000076667::benzo[e]perimidin-7-one::cid_964647
SMILES O=C1c2ccccc2-c2ncnc3cccc1c23
InChI Key InChIKey=WWXLKPRGAXWHFO-UHFFFAOYSA-N
Data  1 IC50
  Tab Delimited (TSV)   2D SDfile   Computed 3D by Vconf -m prep SDfile
Find this compound or compounds like it in BindingDB:
Activity Spreadsheet -- Enzyme Inhibition Constant Data from BindingDB
Found 1 hit for monomerid = 37912
TargetcAMP-dependent protein kinase catalytic subunit alpha(Homo sapiens (Human))
The Scripps Research Institute Molecular Screening Center
Curated by PubChem BioAssay
LigandPNGBDBM37912(7-benzo[e]perimidinone | 7H-benzo[e]perimidin-7-on...)
Affinity DataIC50: >5.96E+4nM. Assay description: Source (MLSCN Center Name): The Scripps Research Institute Molecular Screening Center Center Affiliation: The Scripps Research Institute, TSRI Assay ...
In DepthDetails PCBioAssay