BDBM37928 2-(1H-indol-3-yl)ethyl-(7H-purin-6-yl)amine::MLS000101224::N-[2-(1H-indol-3-yl)ethyl]-7H-purin-6-amine::SMR000015973::cid_165348
SMILES C(Cc1c[nH]c2ccccc12)Nc1ncnc2nc[nH]c12
InChI Key InChIKey=ZNHBCRGNNDKNGI-UHFFFAOYSA-N
Data  1 IC50
  Tab Delimited (TSV)   2D SDfile   Computed 3D by Vconf -m prep SDfile
Find this compound or compounds like it in BindingDB:
Activity Spreadsheet -- Enzyme Inhibition Constant Data from BindingDB
Found 1 hit for monomerid = 37928
TargetcAMP-dependent protein kinase catalytic subunit alpha(Homo sapiens (Human))
The Scripps Research Institute Molecular Screening Center
Curated by PubChem BioAssay
LigandPNGBDBM37928(2-(1H-indol-3-yl)ethyl-(7H-purin-6-yl)amine | MLS0...)
Affinity DataIC50:  1.74E+4nM. Assay description: Source (MLSCN Center Name): The Scripps Research Institute Molecular Screening Center Center Affiliation: The Scripps Research Institute, TSRI Assay ...
In DepthDetails PCBioAssay