BDBM37930 3-phenylpropyl(7H-purin-6-yl)amine::MLS000101223::N-(3-phenylpropyl)-7H-purin-6-amine::SMR000017630::cid_134684
SMILES C(CNc1ncnc2nc[nH]c12)Cc1ccccc1
InChI Key InChIKey=FVBWMJCJGPRURZ-UHFFFAOYSA-N
Data  1 IC50
  Tab Delimited (TSV)   2D SDfile   Computed 3D by Vconf -m prep SDfile
Find this compound or compounds like it in BindingDB:
Activity Spreadsheet -- Enzyme Inhibition Constant Data from BindingDB
Found 1 hit for monomerid = 37930
TargetcAMP-dependent protein kinase catalytic subunit alpha(Homo sapiens (Human))
The Scripps Research Institute Molecular Screening Center
Curated by PubChem BioAssay
LigandPNGBDBM37930(3-phenylpropyl(7H-purin-6-yl)amine | MLS000101223 ...)
Affinity DataIC50:  3.95E+4nM. Assay description: Source (MLSCN Center Name): The Scripps Research Institute Molecular Screening Center Center Affiliation: The Scripps Research Institute, TSRI Assay ...
In DepthDetails PCBioAssay