BDBM37935 6-(4-piperonylpiperazino)-7H-purine::6-[4-(1,3-benzodioxol-5-ylmethyl)-1-piperazinyl]-7H-purine::6-[4-(1,3-benzodioxol-5-ylmethyl)piperazin-1-yl]-7H-purine::MLS000101267::SMR000017662::cid_2155099
SMILES C(N1CCN(CC1)c1ncnc2nc[nH]c12)c1ccc2OCOc2c1
InChI Key InChIKey=VODFSWQUANMLFB-UHFFFAOYSA-N
Data  2 IC50
  Tab Delimited (TSV)   2D SDfile   Computed 3D by Vconf -m prep SDfile
Find this compound or compounds like it in BindingDB:
Activity Spreadsheet -- Enzyme Inhibition Constant Data from BindingDB
Found 2 hits for monomerid = 37935
TargetRho-associated protein kinase 2(Homo sapiens (Human))
The Scripps Research Institute Molecular Screening Center
Curated by PubChem BioAssay
LigandPNGBDBM37935(6-(4-piperonylpiperazino)-7H-purine | 6-[4-(1,3-be...)
Affinity DataIC50:  2.30E+3nM. Assay description: Source (MLSCN Center Name): The Scripps Research Institute Molecular Screening Center Center Affiliation: The Scripps Research Institute, TSRI Assay ...
In DepthDetails PCBioAssay
TargetcAMP-dependent protein kinase catalytic subunit alpha(Homo sapiens (Human))
The Scripps Research Institute Molecular Screening Center
Curated by PubChem BioAssay
LigandPNGBDBM37935(6-(4-piperonylpiperazino)-7H-purine | 6-[4-(1,3-be...)
Affinity DataIC50:  5.46E+3nM. Assay description: Source (MLSCN Center Name): The Scripps Research Institute Molecular Screening Center Center Affiliation: The Scripps Research Institute, TSRI Assay ...
In DepthDetails PCBioAssay