BDBM37944 9-ethoxy-3H-[1,2,5]oxadiazolo[3,4-c]carbazole::9-ethoxy-3H-furazano[3,4-c]carbazole::MLS000107499::SMR000111865::cid_872665
SMILES CCOc1ccc2nc3ccc4[nH]onc4c3c2c1
InChI Key InChIKey=QYCHLAJYIYYAKF-UHFFFAOYSA-N
Data  1 IC50
  Tab Delimited (TSV)   2D SDfile   Computed 3D by Vconf -m prep SDfile
Find this compound or compounds like it in BindingDB:
Activity Spreadsheet -- Enzyme Inhibition Constant Data from BindingDB
Found 1 hit for monomerid = 37944
TargetcAMP-dependent protein kinase catalytic subunit alpha(Homo sapiens (Human))
The Scripps Research Institute Molecular Screening Center
Curated by PubChem BioAssay
LigandPNGBDBM37944(9-ethoxy-3H-[1,2,5]oxadiazolo[3,4-c]carbazole | 9-...)
Affinity DataIC50: >5.96E+4nM. Assay description: Source (MLSCN Center Name): The Scripps Research Institute Molecular Screening Center Center Affiliation: The Scripps Research Institute, TSRI Assay ...
In DepthDetails PCBioAssay