BDBM38301 2-Oxo-4-phenyl-1,2-dihydro-benzo[4,5]furo[3,2-b]pyridine-3-carboxylic acid::2-keto-4-phenyl-1H-benzofuro[3,2-b]pyridine-3-carboxylic acid::2-oxidanylidene-4-phenyl-1H-[1]benzofuro[3,2-b]pyridine-3-carboxylic acid::2-oxo-4-phenyl-1H-[1]benzofuro[3,2-b]pyridine-3-carboxylic acid::2-oxo-4-phenyl-1H-benzofuro[3,2-b]pyridine-3-carboxylic acid::MLS000035365::SMR000010589::cid_655080
SMILES OC(=O)c1c(-c2ccccc2)c2oc3ccccc3c2[nH]c1=O
InChI Key InChIKey=UDIMHEDOWCIESR-UHFFFAOYSA-N
Data  1 IC50
  Tab Delimited (TSV)   2D SDfile   Computed 3D by Vconf -m prep SDfile
Find this compound or compounds like it in BindingDB:
Activity Spreadsheet -- Enzyme Inhibition Constant Data from BindingDB
Found 1 hit for monomerid = 38301
TargetDiphosphomevalonate decarboxylase(Streptococcus pneumoniae D39)
Srmlsc
Curated by PubChem BioAssay
LigandPNGBDBM38301(2-Oxo-4-phenyl-1,2-dihydro-benzo[4,5]furo[3,2-b]py...)
Affinity DataIC50:  1.70E+4nM. Assay description: Southern Research Molecular Libraries Screening Center (SRMLSC) Southern Research Institute (Birmingham, Alabama) NIH Molecular Libraries Screening C...
In DepthDetails PCBioAssay