BDBM38311 3,3-dimethyl-6-(2-oxolanylmethylamino)-8-propan-2-yl-1,4-dihydropyrano[3,4-c]pyridine-5-carbonitrile::3,3-dimethyl-6-(oxolan-2-ylmethylamino)-8-propan-2-yl-1,4-dihydropyrano[3,4-c]pyridine-5-carbonitrile::8-isopropyl-3,3-dimethyl-6-(tetrahydrofurfurylamino)-1,4-dihydropyrano[3,4-c]pyridine-5-carbonitrile::MLS000030457::SMR000039337::cid_658465
SMILES CC(C)c1nc(NCC2CCCO2)c(C#N)c2CC(C)(C)OCc12
InChI Key InChIKey=FNICAFNVQCPFDE-UHFFFAOYSA-N
Data  1 IC50
  Tab Delimited (TSV)   2D SDfile   Computed 3D by Vconf -m prep SDfile
Find this compound or compounds like it in BindingDB:
Activity Spreadsheet -- Enzyme Inhibition Constant Data from BindingDB
Found 1 hit for monomerid = 38311
TargetDiphosphomevalonate decarboxylase(Streptococcus pneumoniae D39)
Srmlsc
Curated by PubChem BioAssay
LigandPNGBDBM38311(3,3-dimethyl-6-(2-oxolanylmethylamino)-8-propan-2-...)
Affinity DataIC50:  9.97E+3nM. Assay description: Southern Research Molecular Libraries Screening Center (SRMLSC) Southern Research Institute (Birmingham, Alabama) NIH Molecular Libraries Screening C...
In DepthDetails PCBioAssay