BDBM38326 4-[3-(2-methoxyphenyl)-[1,2,4]triazolo[3,4-b][1,3,4]thiadiazol-6-yl]-N,N-dimethyl-aniline::4-[3-(2-methoxyphenyl)-[1,2,4]triazolo[3,4-b][1,3,4]thiadiazol-6-yl]-N,N-dimethylaniline::MLS000040388::SMR000043924::[4-[3-(2-methoxyphenyl)-[1,2,4]triazolo[3,4-b][1,3,4]thiadiazol-6-yl]phenyl]-dimethyl-amine::cid_663191
SMILES COc1ccccc1-c1nnc2sc(nn12)-c1ccc(cc1)N(C)C
InChI Key InChIKey=DGGGQOSBUWVGLW-UHFFFAOYSA-N
Data  5 IC50
  Tab Delimited (TSV)   2D SDfile   Computed 3D by Vconf -m prep SDfile
Find this compound or compounds like it in BindingDB:
Activity Spreadsheet -- Enzyme Inhibition Constant Data from BindingDB
Found 5 hits for monomerid = 38326
TargetDiphosphomevalonate decarboxylase(Streptococcus pneumoniae D39)
Srmlsc
Curated by PubChem BioAssay
LigandPNGBDBM38326(4-[3-(2-methoxyphenyl)-[1,2,4]triazolo[3,4-b][1,3,...)
Affinity DataIC50:  1.63E+4nM. Assay description: Southern Research Molecular Libraries Screening Center (SRMLSC) Southern Research Institute (Birmingham, Alabama) NIH Molecular Libraries Screening C...
In DepthDetails PCBioAssay
TargetIsoform 2 of Nuclear receptor ROR-alpha (Alpha-2)(Homo sapiens (Human))
The Scripps Research Institute Molecular Screening Center
Curated by PubChem BioAssay
LigandPNGBDBM38326(4-[3-(2-methoxyphenyl)-[1,2,4]triazolo[3,4-b][1,3,...)
Affinity DataIC50:  3.16E+3nM. Assay description: Source (MLSCN Center Name): The Scripps Research Institute Molecular Screening Center Center Affiliation: The Scripps Research Institute, TSRI Assay ...
In DepthDetails PCBioAssay
TargetSteroidogenic factor 1(Homo sapiens (Human))
The Scripps Research Institute Molecular Screening Center
Curated by PubChem BioAssay
LigandPNGBDBM38326(4-[3-(2-methoxyphenyl)-[1,2,4]triazolo[3,4-b][1,3,...)
Affinity DataIC50:  6.26E+3nM. Assay description: Source (MLSCN Center Name): The Scripps Research Institute Molecular Screening Center Center Affiliation: The Scripps Research Institute, TSRI Assay ...
In DepthDetails PCBioAssay
TargetIsoform 2 of Nuclear receptor ROR-alpha (Alpha-2)(Homo sapiens (Human))
The Scripps Research Institute Molecular Screening Center
Curated by PubChem BioAssay
LigandPNGBDBM38326(4-[3-(2-methoxyphenyl)-[1,2,4]triazolo[3,4-b][1,3,...)
Affinity DataIC50:  2.48E+3nM. Assay description: Source (MLSCN Center Name): The Scripps Research Institute Molecular Screening Center Center Affiliation: The Scripps Research Institute, TSRI Assay ...
In DepthDetails PCBioAssay
TargetSteroidogenic factor 1(Homo sapiens (Human))
The Scripps Research Institute Molecular Screening Center
Curated by PubChem BioAssay
LigandPNGBDBM38326(4-[3-(2-methoxyphenyl)-[1,2,4]triazolo[3,4-b][1,3,...)
Affinity DataIC50:  3.24E+3nM. Assay description: Source (MLSCN Center Name): The Scripps Research Institute Molecular Screening Center Center Affiliation: The Scripps Research Institute, TSRI Assay ...
In DepthDetails PCBioAssay