BDBM38608 6-(4-methylphenyl)-2H-[1,3]thiazolo[2,3-c][1,2,4]triazole-3-thione::6-(4-methylphenyl)-2H-thiazolo[2,3-c][1,2,4]triazole-3-thione::6-(4-methylphenyl)[1,3]thiazolo[2,3-c][1,2,4]triazole-3(2H)-thione::6-(p-tolyl)-2H-thiazolo[2,3-c][1,2,4]triazole-3-thione::MLS000090175::SMR000024787::cid_749059
SMILES Cc1ccc(cc1)-c1cn2c(n[nH]c2=S)s1
InChI Key InChIKey=LKNICEBFAPQJNB-UHFFFAOYSA-N
Data  5 IC50
  Tab Delimited (TSV)   2D SDfile   Computed 3D by Vconf -m prep SDfile
Find this compound or compounds like it in BindingDB:
Activity Spreadsheet -- Enzyme Inhibition Constant Data from BindingDB
Found 5 hits for monomerid = 38608
TargetMevalonate kinase(Streptococcus pneumoniae D39)
Srmlsc
Curated by PubChem BioAssay
LigandPNGBDBM38608(6-(4-methylphenyl)-2H-[1,3]thiazolo[2,3-c][1,2,4]t...)
Affinity DataIC50:  7.42E+4nM. Assay description: Southern Research Molecular Libraries Screening Center (SRMLSC) Southern Research Institute (Birmingham, Alabama) NIH Molecular Libraries Screening C...
In DepthDetails PCBioAssay
TargetMevalonate kinase(Streptococcus pneumoniae D39)
Srmlsc
Curated by PubChem BioAssay
LigandPNGBDBM38608(6-(4-methylphenyl)-2H-[1,3]thiazolo[2,3-c][1,2,4]t...)
Affinity DataIC50: >1.00E+7nM. Assay description: Southern Research Molecular Libraries Screening Center (SRMLSC) Southern Research Institute (Birmingham, Alabama) NIH Molecular Libraries Screening C...
In DepthDetails PCBioAssay
TargetDNA dC->dU-editing enzyme APOBEC-3A(Homo sapiens (Human))
Burnham Center For Chemical Genomics
Curated by PubChem BioAssay
LigandPNGBDBM38608(6-(4-methylphenyl)-2H-[1,3]thiazolo[2,3-c][1,2,4]t...)
Affinity DataIC50: >1.00E+5nMT: 2°C. Assay description: Data Source: Sanford-Burnham Center for Chemical Genomics (SBCCG) Source Affiliation: Sanford-Burnham Medical Research Institute (SBMRI, San Diego, C...
In DepthDetails PCBioAssay
TargetDNA dC->dU-editing enzyme APOBEC-3G(Homo sapiens (Human))
Burnham Center For Chemical Genomics
Curated by PubChem BioAssay
LigandPNGBDBM38608(6-(4-methylphenyl)-2H-[1,3]thiazolo[2,3-c][1,2,4]t...)
Affinity DataIC50:  2.61E+3nMT: 2°C. Assay description: Data Source: Sanford-Burnham Center for Chemical Genomics (SBCCG) Source Affiliation: Sanford-Burnham Medical Research Institute (SBMRI, San Diego, C...
In DepthDetails PCBioAssay
TargetMevalonate kinase(Streptococcus pneumoniae D39)
Srmlsc
Curated by PubChem BioAssay
LigandPNGBDBM38608(6-(4-methylphenyl)-2H-[1,3]thiazolo[2,3-c][1,2,4]t...)
Affinity DataIC50:  1.13E+5nM. Assay description: Southern Research Molecular Libraries Screening Center (SRMLSC) Southern Research Institute (Birmingham, Alabama) NIH Molecular Libraries Screening C...
In DepthDetails PCBioAssay