BDBM386423 (2S,4R)-1-(2-(3- acetyl-5-(2- methylpyrimidin- 5-yl)-1H-indazol- 1-yl)acetyl)-4- fluoro-N-(1- (2,2,2- trifluoroethyl)- 1H-pyrazol-3- yl)pyrrolidine-2- carboxamide::US10287301, Compound 357::US10822352, Comp No. 401
SMILES CC(=O)c1nn(CC(=O)N2C[C@H](F)C[C@H]2C(=O)Nc2ccn(CC(F)(F)F)n2)c2ccc(cc12)-c1cnc(C)nc1
InChI Key InChIKey=XDRUGXQNQBDNGB-NQIIRXRSSA-N
Data  3 IC50
  Tab Delimited (TSV)   2D SDfile   Computed 3D by Vconf -m prep SDfile
Find this compound or compounds like it in BindingDB:
Activity Spreadsheet -- Enzyme Inhibition Constant Data from BindingDB
Found 3 hits for monomerid = 386423
TargetComplement factor D(Homo sapiens (Human))
Achillion Pharmaceuticals
US Patent
LigandPNGBDBM386423((2S,4R)-1-(2-(3- acetyl-5-(2- methylpyrimidin- 5-y...)
Affinity DataIC50: <1.00E+3nM. Assay description: Human Factor D (purified from human serum, Complement Technology, Inc.) at 80 nM final concentration was incubated with test compound at various conc...
Ligand InfoPC cidPC sid
In DepthDetails US Patent
TargetComplement factor D(Homo sapiens (Human))
Achillion Pharmaceuticals
US Patent
LigandPNGBDBM386423((2S,4R)-1-(2-(3- acetyl-5-(2- methylpyrimidin- 5-y...)
Affinity DataIC50: <1.00E+3nM. Assay description: Human Factor D (purified from human serum, Complement Technology, Inc.) at 80 nM final concentration was incubated with test compound at various conc...
Ligand InfoPC cidPC sid
In DepthDetails US Patent
TargetComplement factor D(Homo sapiens (Human))
Achillion Pharmaceuticals
US Patent
LigandPNGBDBM386423((2S,4R)-1-(2-(3- acetyl-5-(2- methylpyrimidin- 5-y...)
Affinity DataIC50: <1.00E+3nM. Assay description: Human Factor D (purified from human serum, Complement Technology, Inc.) at 80 nM final concentration was incubated with test compound at various conc...
Ligand InfoPC cidPC sid
In DepthDetails US Patent