BDBM38804 1-(3-chlorophenyl)-3-[4-(3-methoxyphenyl)-1-piperazinyl]pyrrolidine-2,5-dione::1-(3-chlorophenyl)-3-[4-(3-methoxyphenyl)piperazin-1-yl]pyrrolidine-2,5-dione::1-(3-chlorophenyl)-3-[4-(3-methoxyphenyl)piperazino]pyrrolidine-2,5-quinone::MLS000077823::SMR000035870::cid_661476
SMILES COc1cccc(c1)N1CCN(CC1)c1cc(O)n(c1O)-c1cccc(Cl)c1
InChI Key InChIKey=XROWYKZHDBDXHZ-UHFFFAOYSA-N
Data  1 IC50
  Tab Delimited (TSV)   2D SDfile   Computed 3D by Vconf -m prep SDfile
Find this compound or compounds like it in BindingDB:
Activity Spreadsheet -- Enzyme Inhibition Constant Data from BindingDB
Found 1 hit for monomerid = 38804
TargetM-phase inducer phosphatase 2(Homo sapiens (Human))
University Of Pittsburgh
Curated by PubChem BioAssay
LigandPNGBDBM38804(1-(3-chlorophenyl)-3-[4-(3-methoxyphenyl)-1-pipera...)
Affinity DataIC50: >5.00E+4nM. Assay description: The Cdc25B Phosphatase HTS dose response confirmation has been developed to confirm actives identified in the Cdc25B HTS AID 368, screened at the Uni...
In DepthDetails PCBioAssay