BDBM38825 2-[[1-(4-chloro-2,5-dimethoxy-phenyl)tetrazol-5-yl]thio]acetic acid ethyl ester::2-[[1-(4-chloro-2,5-dimethoxyphenyl)-5-tetrazolyl]thio]acetic acid ethyl ester::MLS000086003::SMR000021332::cid_1017208::ethyl 2-[1-(4-chloro-2,5-dimethoxyphenyl)tetrazol-5-yl]sulfanylacetate::ethyl 2-[[1-(4-chloranyl-2,5-dimethoxy-phenyl)-1,2,3,4-tetrazol-5-yl]sulfanyl]ethanoate::ethyl {[1-(4-chloro-2,5-dimethoxyphenyl)-1H-tetrazol-5-yl]thio}acetate
SMILES CCOC(=O)CSc1nnnn1-c1cc(OC)c(Cl)cc1OC
InChI Key InChIKey=WCKWPAUKQZTVJV-UHFFFAOYSA-N
Data  1 IC50
  Tab Delimited (TSV)   2D SDfile   Computed 3D by Vconf -m prep SDfile
Find this compound or compounds like it in BindingDB:
Activity Spreadsheet -- Enzyme Inhibition Constant Data from BindingDB
Found 1 hit for monomerid = 38825
TargetM-phase inducer phosphatase 2(Homo sapiens (Human))
University Of Pittsburgh
Curated by PubChem BioAssay
LigandPNGBDBM38825(2-[[1-(4-chloro-2,5-dimethoxy-phenyl)tetrazol-5-yl...)
Affinity DataIC50: >5.00E+4nM. Assay description: The Cdc25B Phosphatase HTS dose response confirmation has been developed to confirm actives identified in the Cdc25B HTS AID 368, screened at the Uni...
In DepthDetails PCBioAssay