BDBM388934 4-[5-[4-(dimethylamino)piperidin-1-yl]-8-(6-methoxy-5-methylpyridin-3-yl)imidazo[1,2-c]pyrimidin-7-yl]benzonitrile::US10800779, Example 53::US11401272, Example 53::US9944647, Example 53
SMILES COc1ncc(cc1C)-c1c(nc(N2CCC(CC2)N(C)C)n2ccnc12)-c1ccc(cc1)C#N
InChI Key InChIKey=KYPQHXWQRSUAHO-UHFFFAOYSA-N
Data  3 IC50
  Tab Delimited (TSV)   2D SDfile   Computed 3D by Vconf -m prep SDfile
Find this compound or compounds like it in BindingDB:
Activity Spreadsheet -- Enzyme Inhibition Constant Data from BindingDB
Found 3 hits for monomerid = 388934
TargetLysine-specific histone demethylase 1A(Homo sapiens (Human))
Incyte
US Patent
LigandPNGBDBM388934(4-[5-[4-(dimethylamino)piperidin-1-yl]-8-(6-methox...)
Affinity DataIC50: <50nM. Assay description: LANCE LSD1/KDM1A demethylase assay-10 μL of 1 nM LSD-1 enzyme (ENZO BML-SE544-0050) in the assay buffer (50 mM Tris, pH 7.5, 0.01% Tween-20, 25 ...
Ligand InfoPC cidPC sid
In DepthDetails US Patent
TargetLysine-specific histone demethylase 1A(Homo sapiens (Human))
Incyte
US Patent
LigandPNGBDBM388934(4-[5-[4-(dimethylamino)piperidin-1-yl]-8-(6-methox...)
Affinity DataIC50: <50nM. Assay description: LANCE LSD1/KDM1A demethylase assay 10 μL of 1 nM LSD-1 enzyme (ENZO BML-SE544-0050) in the assay buffer (50 mM Tris, pH 7.5, 0.01% Tween-20, 25 ...
Ligand InfoPC cidPC sid
In DepthDetails US Patent
TargetLysine-specific histone demethylase 1A(Homo sapiens (Human))
Incyte
US Patent
LigandPNGBDBM388934(4-[5-[4-(dimethylamino)piperidin-1-yl]-8-(6-methox...)
Affinity DataIC50: <50nM. Assay description: LANCE LSD1/KDM1A demethylase assay—10 μL of 1 nM LSD-1 enzyme (ENZO BML-SE544-0050) in the assay buffer (50 mM Tris, pH 7.5, 0.01% Tween-20, 25 ...
Ligand InfoPC cidPC sid
In DepthDetails US Patent