BDBM388936 4-[5-{1[(3R)-1-ethylpiperidin-3-yl]methoxy}-8-(3-methyl-2-oxo-2,3-dihydro-1,3-benzoxazol-6-yl)imidazo[1,2-c]pyrimidin-7-yl]benzonitrile::US10800779, Example 55::US11401272, Example 55::US9944647, Example 55
SMILES CCN1CCC[C@@H](COc2nc(-c3ccc(cc3)C#N)c(-c3ccc4n(C)c(=O)oc4c3)c3nccn23)C1
InChI Key InChIKey=PUBFYCMHMCTRNH-HXUWFJFHSA-N
Data  3 IC50
  Tab Delimited (TSV)   2D SDfile   Computed 3D by Vconf -m prep SDfile
Find this compound or compounds like it in BindingDB:
Activity Spreadsheet -- Enzyme Inhibition Constant Data from BindingDB
Found 3 hits for monomerid = 388936
TargetLysine-specific histone demethylase 1A(Homo sapiens (Human))
Incyte
US Patent
LigandPNGBDBM388936(4-[5-{1[(3R)-1-ethylpiperidin-3-yl]methoxy}-8-(3-m...)
Affinity DataIC50: <50nM. Assay description: LANCE LSD1/KDM1A demethylase assay-10 μL of 1 nM LSD-1 enzyme (ENZO BML-SE544-0050) in the assay buffer (50 mM Tris, pH 7.5, 0.01% Tween-20, 25 ...
Ligand InfoPC cidPC sid
In DepthDetails US Patent
TargetLysine-specific histone demethylase 1A(Homo sapiens (Human))
Incyte
US Patent
LigandPNGBDBM388936(4-[5-{1[(3R)-1-ethylpiperidin-3-yl]methoxy}-8-(3-m...)
Affinity DataIC50: <50nM. Assay description: LANCE LSD1/KDM1A demethylase assay 10 μL of 1 nM LSD-1 enzyme (ENZO BML-SE544-0050) in the assay buffer (50 mM Tris, pH 7.5, 0.01% Tween-20, 25 ...
Ligand InfoPC cidPC sid
In DepthDetails US Patent
TargetLysine-specific histone demethylase 1A(Homo sapiens (Human))
Incyte
US Patent
LigandPNGBDBM388936(4-[5-{1[(3R)-1-ethylpiperidin-3-yl]methoxy}-8-(3-m...)
Affinity DataIC50: <50nM. Assay description: LANCE LSD1/KDM1A demethylase assay—10 μL of 1 nM LSD-1 enzyme (ENZO BML-SE544-0050) in the assay buffer (50 mM Tris, pH 7.5, 0.01% Tween-20, 25 ...
Ligand InfoPC cidPC sid
In DepthDetails US Patent